MIRON - Modélisation pour l'Interopérabilité, le Repérage et la réutilisatiON de données du patrimoine culturel québécois
type: Ontology
version IRI: https://stgermain.ebsi.umontreal.ca/miron/1.1.0
imports: cidoc-crm
imports: core
date created: 2024/11/08
creator: https://orcid.org/0000-0001-7426-1690
creator: Marielle St-Germain
license: https://creativecommons.org/licenses/by/4.0/
date modified: 2026/04/23
preferred namespace prefix: miron
prior version: 1.0.0
version info: 1.1.0

date created
type: AnnotationProperty
comment: Date of creation of the resource. @en

creator
type: AnnotationProperty
comment: An entity responsible for making the resource.

license
type: AnnotationProperty
comment: A legal document giving official permission to do something with the resource. @en

date modified
type: AnnotationProperty
comment: date on which the resource was changed @en

source
type: AnnotationProperty
comment: A related resource from which the described resource is derived. @en
scope note: This property is intended to be used with non-literal values. The described resource may be derived from the related resource in whole or in part. Best practice is to identify the related resource by means of a URI or a string conforming to a formal identification system. @en

title
type: AnnotationProperty
comment: A name given to the resource. @en

preferred namespace prefix
type: AnnotationProperty
comment: The preferred namespace prefix to use when using terms from this vocabulary in an XML document. @en

preferred namespace uri
type: AnnotationProperty
comment: The preferred namespace URI to use when using terms from this vocabulary in an XML document. @en

abréviation
type: AnnotationProperty
comment: Cette propriété décrit la forme réduite ou graphique d'un ou plusieurs mots.
sub property of: altLabel

synonyme
type: AnnotationProperty

est accessoire de
type: ObjectProperty
inverse of: a pour accessoire
domain: E24 Physical Human-Made Thing
range: E22 Human-Made Object
comment: relation unissant une instance de « Objet élaboré par l'humain » à une ou plusieurs instances de la classe « Chose matérielle élaborée par l'humain », qu'elle complète ou pour laquelle elle améliore le fonctionnement
editorial note: Cette relation correspond à la relation de contiguïté Accessoire-Objet.
editorial note: une perche à égoportrait (Objet pour la photographie) est un accessoire de (accessoireObjet) un téléphone intelligent (Objet pour la télécommunication)

a pour motif
type: ObjectProperty
domain: E70 Thing
range: Motif
comment: relation unissant une instance de « Chose » à une ou plusieurs instances de la classe « Motif » ornant la première instance d'un thème ornemental ou figuratif, habituellement répété

a pour contenu
type: ObjectProperty
inverse of: a pour contenant
domain: E22 Human-Made Object
range: E1 CRM Entity
comment: relation unissant une instance de « Objet élaboré par l'humain » à une ou plusieurs instances de la classe « Entité CRM » représentant le contenu prévu pour la première instance
editorial note: Cette propriété correspond à la relation de contiguïté Contenant-Contenu.
example: une custode (Contenant) a comme contenu (contenantContenu) une hostie consacrée (Objet du culte catholique)

a pour contenant
type: ObjectProperty
domain: E1 CRM Entity
range: E22 Human-Made Object
comment: relation unissant une instance de « Entité CRM » à une ou plusieurs instances de « Objet élaboré par l'humain » représentant le contenant prévu pour un contenu donné
editorial note: Cette propriété correspond à la relation de contiguïté Contenu-Contenant.
example: une hostie consacrée (Objet du culte catholique) a comme contenant (contenuContenant) une custode (Contenant)

fait partie de
type: ObjectProperty
inverse of: comprend
domain: E24 Physical Human-Made Thing
range: E22 Human-Made Object
comment: relation unissant une instance de « Chose matérielle élaborée par l'humain » à une ou plusieurs instances de la classe « Objet élaboré par l’humain » possédant une structure définie reflétant son découpage en composantes (éléments) entretenant une relation fonctionnelle avec le tout
editorial note: Cette propriété correspond à la relation partitive Élément-Objet.
editorial note: Cette relation possède la propriété de fonctionnalité, c'est-à-dire que le concept partitif (élément) remplit une fonction du concept intégrant (objet).
editorial note: Cette relation possède la propriété de séparabilité, c'est-à-dire que le concept partitif (élément) peut être séparé du concept intégrant (objet) sans que l'identité du concept intégrant ne soit affectée.
example: une anse (Caractéristique élaborée par l'humain) fait partie de (elementObjet) une tasse (Objet pour le service des aliments)

est composé de
type: ObjectProperty
inverse of: fait partie de
type: TransitiveProperty
domain: E22 Human-Made Object
range: E22 Human-Made Object
comment: relation unissant une instance de « Objet élaboré par l'humain » à une ou plusieurs instances de la même classe qui fait partie d'un ensemble impliquant une proximité avec les membres et non pas une similarité, chaque membre occupant une fonction spécifique dans l'ensemble
editorial note: Cette propriété correspond à la relation partitive Ensemble-Membre.
editorial note: Cette relation possède la propriété de séparabilité, c'est-à-dire que le concept partitif (membre) peut être séparé du concept intégrant (ensemble) sans que l'identité du concept intégrant ne soit affectée.
example: un jeu de dames (Objet pour le jeu) est composé de (ensembleMembre) un pion (Accessoire ou composant de jeu)

a pour patient
type: ObjectProperty
inverse of: est patient de
domain: E22 Human-Made Object
range: E1 CRM Entity
comment: relation unissant une instance de « Objet élaboré par l’humain » à une ou plusieurs instances de la classe « Entité CRM » subissant ou étant l'objet d'une action découlant de l'usage prévu de l'objet
editorial note: Cette relation correspond à la relation instrumentale Instrument-Patient.
example: un porte-bébé (Véhicule à propulsion ou à traction humaine) a comme patient (instrumentPatient) un bébé (Personne)

permet de manipuler
type: ObjectProperty
inverse of: est manipulé par
domain: E24 Physical Human-Made Thing
range: E22 Human-Made Object
comment: relation unissant une instance de « Chose matérielle élaborée par l'humain » à une instance de la classe « Objet élaboré par l'humain » qui doit être présente afin de permettre ou faciliter l'usage de la seconde
editorial note: Cette relation correspond à la relation instrumentale Objet utilisé pour sa manipulation-Objet.
example: un arc (Arme blanche) permet de manipuler (manipulationObjet) une flèche (Arme blanche)

constitue
type: ObjectProperty
inverse of: est constitué de
domain: E57 Material
range: E57 Material
comment: relation unissant une instance de « Matériau » à une ou plusieurs instances de la même classe, la première instance étant un élément, soit un autre matériau, qui constitue, compose, la seconde
example: la fibre de coton (Fibre) constitue (materiauComposantMateriauCompose) un tissu en coton (Tissu)

est constitué de
type: ObjectProperty
domain: E57 Material
range: E57 Material
comment: relation unissant une instance de « Matériau » à une ou plusieurs instances de la même classe, la première instance étant composée, constituée, de la seconde
example: un tissu de coton (Tissu) est composé de (materiauCompoeMateriauComposant) la fibre de coton (Fibre)

provient de
type: ObjectProperty
domain: E57 Material
range: Organisme vivant
comment: relation unissant une instance de « Matériau » à une instance de la classe « Organisme vivant » de laquelle la matériau est issu, peu importe sa nature
editorial note: Cette propriété correspond à la relation complexe Matériau-Organisme vivant.
example: la fibre de coton (Fibre) provient de (materiauOrganismeVivant) le cotonnier (Végétal)

fait partie de
type: ObjectProperty
domain: E22 Human-Made Object
range: E22 Human-Made Object
comment: relation unissant une instance de « Objet élaboré par l'humain » à une ou plusieurs instances de la même classe, la première instance faisant partie d'un ensemble impliquant une proximité avec les membres et non pas une similarité, chaque membre occupant une fonction spécifique dans l'ensemble
editorial note: Cette propriété correspond à la relation partitive Membre-Ensemble.
editorial note: Cette relation possède la propriété de séparabilité, c'est-à-dire que le concept partitif (membre) peut être séparé du concept intégrant (ensemble) sans que l'identité du concept intégrant ne soit affectée.
example: un pion (Accessoire ou composant de jeu) fait partie de (membreEnsemble) un jeu de dames (Objet pour le jeu)

a pour accessoire
type: ObjectProperty
domain: E22 Human-Made Object
range: E24 Physical Human-Made Thing
comment: relation unissant une instance de « Objet élaboré par l'humain » à une ou plusieurs instances de la classe « Chose matérielle élaborée par l'humain », la première instance étant complétée par la seconde, ou son fonctionnement étant amélioré par la seconde
editorial note: Cette relation correspond à la relation de contiguïté Objet-Accessoire.
example: un téléphone intelligent (Objet pour la télécommunication) a pour accessoire (objetAccessoire) une perche à égoportrait (Objet pour la photographie)

comprend
type: ObjectProperty
type: TransitiveProperty
domain: E22 Human-Made Object
range: E24 Physical Human-Made Thing
comment: relation unissant une instance de « Objet élaboré par l’humain » à une ou plusieurs instances de la classe « Chose matérielle élaborée par l'humain », la première possédant une structure définie reflétant son découpage en composantes (éléments) entretenant une relation fonctionnelle avec le tout
editorial note: Cette propriété correspond à la relation partitive Objet-Élément.
editorial note: Cette relation possède la propriété de fonctionnalité, c'est-à-dire que le concept partitif (élément) remplit une fonction du concept intégrant (objet).
editorial note: Cette relation possède la propriété de séparabilité, c'est-à-dire que le concept partitif (élément) peut être séparé du concept intégrant (objet) sans que l'identité du concept intégrant ne soit affectée.
example: une tasse (Objet pour le service des aliments) comprend (objetElement) une anse (Caractéristique élaborée par l'humain)

est manipulé par
type: ObjectProperty
domain: E22 Human-Made Object
range: E24 Physical Human-Made Thing
comment: relation unissant une instance de « Objet élaboré par l'humain » à une ou plusieurs instances de la classe « Chose matérielle élaborée par l'humain », la première instance nécessitant la présence de la seconde pour permettre ou faciliter son usage
editorial note: Cette relation correspond à la relation instrumentale Objet-Objet utilisé pour sa manipulation.
example: une flèche (Arme blanche) peut être manipulée par (objetManipulation) un arc (Arme blanche)

permet de produire
type: ObjectProperty
inverse of: est produit par
domain: E22 Human-Made Object
range: E70 Thing
comment: relation unissant une instance de « Objet élaboré par l'humain » à une ou plusieurs instances de la classe « Chose » représentant le résultat issu de l'utilisation prévue de la première instance
editorial note: Cette propriété correspond à la relation d'origine Objet-Produit.
example: un appareil photographique (Objet pour la photographie) permet de produire (objetProduit) une photographie (Objet documentaire et Œuvre d'art)

est patient de
type: ObjectProperty
domain: E1 CRM Entity
range: E22 Human-Made Object
comment: relation unissant une instance de « Entité CRM » à une ou plusieurs instances de la classe « Objet élaboré par l'humain », la première instance subissant ou étant l'objet d'une action découlant de l'usage prévu de la seconde
editorial note: Cette relation correspond à la relation instrumentale Patient-Instrument.
editorial note: un bébé (Personne) est patient de (patientInstrument) un porte-bébé (Véhicule à propulsion ou à traction humaine)

peut être traité par
type: ObjectProperty
sub property of: est patient de
inverse of: permet de traiter
domain: E57 Material
range: E22 Human-Made Object
comment: relation unissant une instance de « Matériau » à une instance de la classe « Objet élaboré par l'humain », la première instance pouvant être traitée, soit contrôlée, surveillée, récoltée, recueillie, transformée, modifiée ou servie par le biais de l'utilisation prévue de la seconde instance

permet de servir
type: ObjectProperty
sub property of: permet de traiter
domain: Objet pour le service des aliments
range: Aliment
comment: relation unissant une instance de « Objet pour le service des aliments » à une ou plusieurs instances de la classe « Aliment » qui peut être servie, pour la consommation, par le biais de l'utilisation prévue de la première instance

a pour résultat
type: ObjectProperty
inverse of: résulte de
domain: Procédé ou technique
range: E70 Thing
comment: relation unissant une instance de la classe « Technique ou Procédé » et une ou plusieurs instances de la classe « Chose » l'ayant produite, c'est-à-dire qu'une technique ou un procédé est mis en oeuvre pour obtenir ce type d'objet
editorial note: Cette relation correspond à la relation d'activité Procédé ou technique-Résultat.
example: la technique de la broderie (Technique ou procédé d’ouvrage à l’aiguille) a pour résultat (procedeOuTechniqueResultat) une broderie (Œuvre visuelle) résulte de (resultatProcedeOuTechnique)

est constitué de
type: ObjectProperty
domain: E22 Human-Made Object
range: E57 Material
comment: relation unissant une instance de la classe « Objet élaboré par l'humain » et une ou plusieurs instances de la classe « Matériau » la constituant, c'est-à-dire que l'objet est un tout rassemblant un ou plusieurs matériaux
editorial note: Cette relation correspond à la relation d'origine Produit-Matériau.
example: un bureau (Meuble) est constitué de (produitMateriau) bois (Matière végétale)

est produit par
type: ObjectProperty
domain: E70 Thing
range: E22 Human-Made Object
comment: relation unissant une instance de « Chose » à une instance de la classe « Objet élaboré par l'humain », la première instance représentant le résultat issu de l'utilisation prévue de la seconde instance
editorial note: Cette propriété correspond à la relation d'origine Produit-Objet.
editorial note: une photographie (Objet documentaire et Œuvre d'art) est produit par (produitObjet) un appareil photographique (Objet pour la photographie)

a pour support
type: ObjectProperty
sub property of: est constitué de
domain: E22 Human-Made Object
range: E57 Material
source: https://usito.usherbrooke.ca/d%C3%A9finitions/support
comment: relation unissant une instance de la classe « Objet élaboré par l'humain » et une ou plusieurs instances de la classe « Matériau » étant un élément matériel susceptible de recevoir une œuvre visuelle ou un matériau sur lequel on fait l'impression
editorial note: Cette relation correspond à la relation complexe Produit-Support.
example: une affiche (Support publicitaire) a pour support (produitSupport) le papier cartonné (Papier)

résulte de
type: ObjectProperty
domain: E70 Thing
range: Procédé ou technique
comment: relation unissant une instance de la classe « Chose » et une ou plusieurs instances de la classe « Technique ou procédé » la produisant, c'est-à-dire qu'une technique ou un procédé est mis en oeuvre pour obtenir ce type d'objet
editorial note: Cette relation correspond à la relation d'activité Résultat-Procédé ou technique.
example: une broderie (Œuvre visuelle) résulte de (resultatProcedeOuTechnique) la technique de la broderie (Technique ou procédé d’ouvrage à l’aiguille)

rappelle ou commémore
type: ObjectProperty
domain: Souvenir
range: E1 CRM Entity
comment: relation unissant une instance de « Souvenir » à une instance de la classe « Entité CRM » dont la première instance remet en mémoire, rappelle le souvenir de la seconde instance
example: une assiette commémorative (Souvenir) rappelle ou commémore (souvenirEntite) Élisabeth II (Personne)

permet de traiter
type: ObjectProperty
sub property of: a pour patient
domain: E22 Human-Made Object
range: E57 Material
comment: relation unissant une instance de « Objet élaboré par l'humain » à une ou plusieurs instances de la classe « Matériau » qui peut être traitée, soit contrôlée, surveillée, récoltée, recueillie, transformée, modifiée ou servie par le biais de l'usage prévu de la première instance
editorial note: Cette relation correspond à la relation instrumentale Traitement-Patient.
example: un chalumeau (Objet pour le traitement des aliments) permet de traiter (traitementPatient) l'eau d'érable (Matière végétale)

Procédé ou technique d’addition ou d’assemblage
type: Class
subclass of: Procédé ou technique
source: http://vocab.getty.edu/page/aat/300229467
comment: procédé ou technique permettant d'ajouter des éléments à d'autres ou à les réunir
preferred label: procédé ou technique d’addition ou d’assemblage

Animal
type: Class
subclass of: Organisme vivant
source: https://usito.usherbrooke.ca/d%C3%A9finitions/animal#aaF25c7fd6560e76
source: https://vitrinelinguistique.oqlf.gouv.qc.ca/fiche-gdt/fiche/8352383/animal
comment: organisme vivant organisé, élémentaire ou complexe, doué de sensibilité et généralement doué de mobilité
hidden label: animalia
preferred label: animal

Objet de l’environnement bâti
type: Class
subclass of: E22 Human-Made Object
source: https://nomenclature.info/nom/2
source: https://www.musees.qc.ca/fr/professionnel/guidesel/doccoll/fr/classificationethno/classificationethnodefinition.htm#Categorie1
comment: objet élaboré par l'humain créé pour définir l'espace des activités humaines ou pour servir d'éléments délimitant l'espace
alternative label: construction et éléments distinctifs
alternative label: objets de l'environnement bâti
hidden label: catégorie 01
hidden label: catégorie 1
preferred label: objet de l’environnement bâti

Construction
type: Class
subclass of: Objet de l’environnement bâti
source: https://nomenclature.info/nom/543
source: https://www.musees.qc.ca/fr/professionnel/guidesel/doccoll/fr/classificationethno/classificationethnodefinition.htm#souscat1_1
comment: objet de l'environnement bâti créé pour fournir ou délimiter un espace destiné aux activités humaines
alternative label: Bâtiment
alternative label: Constructions
example: section d'un mur;section d'un toit
preferred label: construction
scope note: Les constructions peuvent être permantentes, portatives, à régulation climatique ou à libre circulation de l'air et peuvent servir à diverses fins cérémonielles, agricoles, récréatives, commerciales, culturelles, civiques, industrielles ou sociales.

Objet pour l’ameublement de l’environnement bâti
type: Class
subclass of: E22 Human-Made Object
source: https://nomenclature.info/nom/967
source: https://www.musees.qc.ca/fr/professionnel/guidesel/doccoll/fr/classificationethno/classificationethnodefinition.htm#Categorie2
comment: objet élaboré par l'humain créé pour faciliter l'activité humaine et pour répondre aux besoins matériels des personnes, en assurant confort, commodité ou protection
alternative label: ameublement et accessoires
alternative label: ameublement et décoration
hidden label: catégorie 02
hidden label: catégorie 2
preferred label: objet pour l’ameublement de l’environnement bâti
scope note: L'ameublement est constitué d'objets permettant l'activité humaine en lui fournissant un cadre passif.

Accessoire ménager
type: Class
subclass of: Objet pour l’ameublement de l’environnement bâti
source: https://nomenclature.info/nom/1499
source: https://www.musees.qc.ca/fr/professionnel/guidesel/doccoll/fr/classificationethno/classificationethnodefinition.htm#souscat2_1
comment: objet pour l'ameublement de l'environnement bâti créé pour être disposé à l'intérieur ou autour d'un bâtiment pour la commodité des personnes, c'est-à-dire afin d'améliorer, de compléter ou de faciliter l'entretien de leur environnement
alternative label: accessoire de maison
alternative label: accessoires ménagers
example: porte-savon;crachoir;aquarium;cendrier;têtière;nappe;plateau de cartes de visite;caisse
preferred label: accessoire ménager
scope note: Cette classe comprend de petits accessoires, des objets autres que du mobilier servant au rangement et à la présentation ainsi que des objets protégeant les meubles.

Appareil sanitaire
type: Class
subclass of: Objet pour l’ameublement de l’environnement bâti
source: https://www.musees.qc.ca/fr/professionnel/guidesel/doccoll/fr/classificationethno/classificationethnodefinition.htm#souscat2_8
comment: objet pour l'ameublement de l'environnement bâti créé pour répondre aux besoins d'hygiène de la vie de tous les jours et conçu pour être fixé, en tant que partie intégrante, aux conduites d'eau et d'égout, souvent à l'intérieur d'une construction
alternative label: sanitaire
example: baignoire;robinet;évier;lavabo
preferred label: appareil sanitaire

Literie
type: Class
subclass of: Objet pour l’ameublement de l’environnement bâti
source: https://nomenclature.info/nom/968
source: https://www.musees.qc.ca/fr/professionnel/guidesel/doccoll/fr/classificationethno/classificationethnodefinition.htm#souscat2_4
comment: objet pour l'ameublement de l'environnement bâti créé pour être utilisé comme article de literie ou accessoire de lit
example: couverture;oreiller;hamac;sac de couchage
preferred label: literie

Meuble
type: Class
subclass of: Objet pour l’ameublement de l’environnement bâti
source: https://nomenclature.info/nom/1062
source: https://www.musees.qc.ca/fr/professionnel/guidesel/doccoll/fr/classificationethno/classificationethnodefinition.htm#souscat2_5
comment: objet pour l'ameublement de l'environnement bâti créé pour répondre aux besoins matériels des personnes et pour assurer leur confort dans leurs espaces de vie et de travail
alternative label: meubles
alternative label: mobilier
example: bureau;table;lit;chaise;meuble d'extérieur
preferred label: meuble

Objet pour l’éclairage
type: Class
subclass of: Objet pour l’ameublement de l’environnement bâti
source: https://nomenclature.info/nom/1654
source: https://www.musees.qc.ca/fr/professionnel/guidesel/doccoll/fr/classificationethno/classificationethnodefinition.htm#souscat2_3
comment: objet pour l'ameublement de l'environnement bâti créé pour l'éclairage
alternative label: éclairage
alternative label: équipement d'éclairage
example: mouchette;coupe-mèche;lanterne à kérosène;lampadaire;projecteur de scène;éteignoir;accessoire de phare
preferred label: objet pour l’éclairage

Revêtement de sol
type: Class
subclass of: Objet pour l’ameublement de l’environnement bâti
source: https://nomenclature.info/nom/1030
source: https://www.musees.qc.ca/fr/professionnel/guidesel/doccoll/fr/classificationethno/classificationethnodefinition.htm#souscat2_7
comment: objet pour l'ameublement de l'environnement bâti créé pour couvrir, de façon temporaire ou amovible, le sol à l'intérieur ou à l'extérieur d'un bâtiment
alternative label: revêtements de sol
example: carpette;paillasson;tapis
preferred label: revêtement de sol

Objet personnel
type: Class
subclass of: E22 Human-Made Object
source: https://nomenclature.info/nom/1934
source: https://www.musees.qc.ca/fr/professionnel/guidesel/doccoll/fr/classificationethno/classificationethnodefinition.htm#Categorie3
comment: objet élaboré par l'humain créé pour répondre aux besoins personnels d'habillement, d'ornementation, de protection du corps ou de toilette
alternative label: objets personnels
alternative label: vêtements et accessoires
hidden label: catégorie 03
hidden label: catégorie 3
preferred label: objet personnel

Article de toilette
type: Class
subclass of: Objet personnel
source: https://nomenclature.info/nom/2987
source: https://www.musees.qc.ca/fr/professionnel/guidesel/doccoll/fr/classificationethno/classificationethnodefinition.htm#souscat3_1
comment: objet personnel créé pour la toilette, l'hygiène, les soins personnels ou les soins esthétiques
alternative label: accessoire de toilette
alternative label: articles de toilette
example: rasoir;brosse à dents;maquillage
preferred label: article de toilette

Article personnel
type: Class
subclass of: Objet personnel
source: https://nomenclature.info/nom/2694
source: https://www.musees.qc.ca/fr/professionnel/guidesel/doccoll/fr/classificationethno/classificationethnodefinition.htm#souscat3_2
comment: objet personnel créé pour servir aux personnes d’articles pour l’entretien des vêtements, d’articles pour transporter ou pour ranger des effets personnels, d’articles de protection, d’aides personnelles ou physiques ou d’équipement pour la consommation de tabac ou de substances
alternative label: accessoire personnel
alternative label: articles personnels
example: quille de gantier;portefeuille;sac à dos;parapluie;lunette de sécurité;canne;lunette;pipe;valise;prothèse
preferred label: article personnel

Vêtement
type: Class
subclass of: Objet personnel
source: https://nomenclature.info/nom/1999
comment: objet personnel créé pour vêtir le corps humain
alternative label: vêtements
preferred label: vêtement

Accessoire vestimentaire
type: Class
subclass of: Vêtement
source: https://nomenclature.info/nom/1999
source: https://www.musees.qc.ca/fr/professionnel/guidesel/doccoll/fr/classificationethno/classificationethnodefinition.htm#souscat3_3
comment: article vestimentaire créé pour être utilisé avec des vêtements ou qui se portent sur les mains, les bras ou le cou, ou créé pour la fixation, la protection ou l’ornementation des vêtements
alternative label: accessoires et composants vestimentaires
preferred label: accessoire vestimentaire

Chaussure
type: Class
subclass of: Vêtement
subclass of: Restriction
  on property: comprend
source: https://nomenclature.info/nom/2143
source: https://www.musees.qc.ca/fr/professionnel/guidesel/doccoll/fr/classificationethno/classificationethnodefinition.htm#souscat3_4
comment: article vestimentaire créé pour être porté sur les pieds ou le bas des jambes afin de les protéger ou les couvrir
alternative label: chaussures
example: botte;bas;guêtre
preferred label: chaussure

Coiffure
type: Class
subclass of: Vêtement
source: https://nomenclature.info/nom/2216
comment: article vestimentaire créé pour être porté sur la tête afin de la protéger ou la couvrir
alternative label: coiffures
alternative label: https://www.musees.qc.ca/fr/professionnel/guidesel/doccoll/fr/classificationethno/classificationethnodefinition.htm#souscat3_5
example: bonnet;tricorne;turban
preferred label: coiffure

Sous-vêtement
type: Class
subclass of: Vêtement
source: https://nomenclature.info/nom/2626
source: https://www.musees.qc.ca/fr/professionnel/guidesel/doccoll/fr/classificationethno/classificationethnodefinition.htm#souscat3_7
comment: article vestimentaire créé pour être porté sous les vêtements principaux, pour protéger les vêtements contre le corps, pour protéger le corps contre les vêtements ou pour prêter une forme ou un soutien à des parties du corps
alternative label: sous-vêtements
example: jupon;corset;caleçon
preferred label: sous-vêtement

Vêtement de dessus
type: Class
subclass of: Vêtement
source: https://nomenclature.info/nom/2537
comment: article vestimentaire porté par-dessus les vêtements principaux, habituellement pour se protéger du froid et des intempéries
alternative label: vêtements de dessus
preferred label: vêtement de dessus

Objet pour le traitement des matériaux
type: Class
equivalent class: Class
  intersection of: E22 Human-Made Object
  intersection of: Restriction
    on property: permet de traiter
    all values from: E57 Material
subclass of: E22 Human-Made Object
source: https://nomenclature.info/nom/3176
source: https://www.musees.qc.ca/fr/professionnel/guidesel/doccoll/fr/classificationethno/classificationethnodefinition.htm#Categorie4
comment: objet élaboré par l'humain créé pour contrôler, surveiller, récolter ou recueillir des ressources ou pour transformer, modifier ou servir certaines matières, premières ou transformées
alternative label: outillage et équipement pour le traitement de matières premières
alternative label: outillage et équipement pour le traitement des matériaux
hidden label: catégorie 04
hidden label: catégorie 4
preferred label: objet pour le traitement des matériaux
scope note: Les objets pour le traitement des matériaux sont normalement créés pour résoudre des problèmes inhérents aux matériaux eux-mêmes. Ainsi, le bois, par exemple, exige certains types d'appareils de coupe; la pêche nécessite certains appâts; la nourriture requiert certains ustensiles de service et de transformation.

Objet pour l’agriculture
type: Class
subclass of: Objet pour le traitement des matériaux
source: https://nomenclature.info/nom/3177
source: https://www.musees.qc.ca/fr/professionnel/guidesel/doccoll/fr/classificationethno/classificationethnodefinition.htm#souscat4_1
comment: objet pour le traitement des matériaux créé pour la culture ou le jardinage
alternative label: agriculture
alternative label: outils et équipement, agriculture
example: semoir
preferred label: objet pour l’agriculture
scope note: Cette classe comprend les instruments d’ensemencement, d’entretien, de récolte et d’entreposage des produits culturaux, ainsi que les appareils de transformation des aliments destinés aux animaux, mais non aux humains.

Objet pour la peinture ou le recouvrement
type: Class
subclass of: Objet pour le traitement des matériaux
source: https://nomenclature.info/nom/6624
source: https://www.musees.qc.ca/fr/professionnel/guidesel/doccoll/fr/classificationethno/classificationethnodefinition.htm#souscat4_11
comment: objet pour le traitement des matériaux créé pour le travail avec des matériaux recouvrant les surfaces par le dépôt d'une couche résiduelle comme une couche de peinture, ou par l'emploi d'adhésifs pour poser sur une surface un recouvrement mince comme du papier peint ou de la feuille d'or
alternative label: outils et équipement, peinture
alternative label: peinture et recouvrement
example: couteau à mastiquer;palette;pinceau
preferred label: objet pour la peinture ou le recouvrement
scope note: Cette classe comprend les outils, l’équipement et les fournitures utilisés à des fins décoratives, artistiques et de protection.

Objet pour la pêche ou le piégeage
type: Class
subclass of: Objet pour le traitement des matériaux
subclass of: Restriction
  on property: a pour patient
  some values from: Organisme vivant
source: https://nomenclature.info/nom/3802
source: https://www.musees.qc.ca/fr/professionnel/guidesel/doccoll/fr/classificationethno/classificationethnodefinition.htm#souscat4_10
comment: objet pour le traitement des matériaux créés pour la capture d'animaux aquatiques et terrestres par tout autre moyen que les armes
alternative label: outils et équipement, pêche, chasse et piégeage
alternative label: pêche et piégeage
preferred label: objet pour la pêche ou le piégeage

Objet pour le service des aliments
type: Class
subclass of: Objet pour le traitement des matériaux
subclass of: Restriction
  on property: permet de servir
  some values from: Aliment
source: https://nomenclature.info/nom/4867
source: https://www.musees.qc.ca/fr/professionnel/guidesel/doccoll/fr/classificationethno/classificationethnodefinition.htm#souscat4_14
comment: objet pour le traitement des matériaux créé pour la présentation, le service ou la consommation des aliments ou des boissons destinés à la consommation humaine
alternative label: outils et équipement, service des aliments
alternative label: service des aliments
example: soucoupe;tasse;ramasse-miette
preferred label: objet pour le service des aliments

Objet pour le traitement des aliments
type: Class
equivalent class: Class
  intersection of: Objet pour le traitement des matériaux
  intersection of: Restriction
    on property: permet de traiter
    some values from: Aliment
subclass of: Objet pour le traitement des matériaux
source: https://nomenclature.info/nom/3941
source: https://www.musees.qc.ca/fr/professionnel/guidesel/doccoll/fr/classificationethno/classificationethnodefinition.htm#souscat4_15
comment: objet pour le traitement des matériaux créé pour la transformation, l'entreposage et la préparation des aliments ou des boissons destinés à la consommation humaine
alternative label: outils et équipement, transformation et préparation des aliments
alternative label: traitement des aliments
example: tasse à mesurer;réfrigérateur;baratte
preferred label: objet pour le traitement des aliments
scope note: Cette classe comprend les instruments, les appareils et l'équipement utilisé pour transformer les aliments.

Objet pour le travail des textiles
type: Class
equivalent class: Class
  intersection of: Objet pour le traitement des matériaux
  intersection of: Restriction
    on property: permet de traiter
    all values from: Fibre
subclass of: Objet pour le traitement des matériaux
source: https://nomenclature.info/nom/6755
source: https://www.musees.qc.ca/fr/professionnel/guidesel/doccoll/fr/classificationethno/classificationethnodefinition.htm#souscat4_19
comment: objet pour le traitement des matériaux créé pour la préparation de matériaux faits de fibres et pour la préparation de tissus
alternative label: outils et équipement, travail du textile
alternative label: travail des fibres et confection
editorial note: Un textile est une fibre qui peut être tissée.
example: séran;égreneuse à coton;bobine;métier;dévidoir;fuseau
preferred label: objet pour le travail des textiles
scope note: Cette classe comprend les outils, les pièces d'équipement et les fournitures servant à la fabrication d’objets à partir de tissu ainsi que les outils de préparation des fibres pour la conception de tissus.

Objet pour le travail du bois
type: Class
equivalent class: Class
  intersection of: Objet pour le traitement des matériaux
  intersection of: Restriction
    on property: permet de traiter
    all values from: Bois
subclass of: Objet pour le traitement des matériaux
source: https://nomenclature.info/nom/7142
source: https://www.musees.qc.ca/fr/professionnel/guidesel/doccoll/fr/classificationethno/classificationethnodefinition.htm#souscat4_20
comment: objet pour le traitement des matériaux créé pour la fabrication d'objets en bois
alternative label: outils et équipement, travail du bois
alternative label: travail du bois
example: serre-joints;scie;rabot
preferred label: objet pour le travail du bois
scope note: Cette classe comprend les objets utilisés pour fabriquer des produits dérivés à partir de bois modifié physiquement, ou pour fabriquer des objets à partir de ces produits dérivés.

Objet pour le travail du métal
type: Class
equivalent class: Class
  intersection of: Objet pour le traitement des matériaux
  intersection of: Restriction
    on property: permet de traiter
    all values from: Métal
subclass of: Objet pour le traitement des matériaux
source: https://nomenclature.info/nom/5828
source: https://www.musees.qc.ca/fr/professionnel/guidesel/doccoll/fr/classificationethno/classificationethnodefinition.htm#souscat4_21
comment: objet pour le traitement des matériaux créé pour la fonderie, l'usinage, coulage, le moulage, le forgeage, le façonnage ou la fabrication des métaux ou des produits métalliques
alternative label: outils et équipement, travail des métaux
alternative label: travail du métal
example: enclume;étau;gueuse
preferred label: objet pour le travail du métal

Objet à usage polyvalent pour le traitement des matériaux
type: Class
subclass of: Objet pour le traitement des matériaux
source: https://nomenclature.info/nom/6520
comment: objet pour le traitement des matériaux créé pour transformer ou modifier différents matériaux selon le contexte d’usage
alternative label: outils et équipement, utilisation polyvalente pour le traitement des matériaux
preferred label: objet à usage polyvalent pour le traitement des matériaux

Objet pour les sciences ou la technologie
type: Class
subclass of: E22 Human-Made Object
source: https://nomenclature.info/nom/7685
source: https://www.musees.qc.ca/fr/professionnel/guidesel/doccoll/fr/classificationethno/classificationethnodefinition.htm#Categorie5
comment: objet élaboré par l'humain créé pour l'observation des phénomènes naturels ou pour l'application des connaissances tirées de ces observations
alternative label: armement, sciences et technologies
alternative label: outillage et équipement pour les sciences et la technologie
hidden label: catégorie 05
hidden label: catégorie 5
preferred label: objet pour les sciences ou la technologie
scope note: Les objets pour les sciences ou la technologie visent généralement à augmenter ou à documenter les connaissances sur le monde qui nous entoure ou pour exprimer ces connaissances. Les sous-classes de cette classe sont apparentées en vertu du fait qu'elles comprennent des objets élaborés par l'humain créés pour exploiter un domaine particulier de connaissances. Elles sont donc basées sur les connaissances plutôt que les matériaux.

Objet pour la chronométrie
type: Class
subclass of: Objet pour les sciences ou la technologie
source: https://nomenclature.info/nom/10258
source: https://www.musees.qc.ca/fr/professionnel/guidesel/doccoll/fr/classificationethno/classificationethnodefinition.htm#souscat5_12
comment: objet pour les sciences ou la technologie créé pour enregistrer ou mesurer le temps
alternative label: chronométrie
alternative label: outils et équipement, chronométrie
preferred label: objet pour la chronométrie

Objet pour l’entretien ou la maintenance
type: Class
subclass of: Objet pour les sciences ou la technologie
source: https://nomenclature.info/nom/8952
source: https://www.musees.qc.ca/fr/professionnel/guidesel/doccoll/fr/classificationethno/classificationethnodefinition.htm#souscat5_16
comment: objet pour les sciences ou la technologie créé pour les activités de nettoyage, la buanderie ou l'entretien paysager effectués dans ou autour d'un bâtiment privé ou public, qu'elles soient exécutées occasionnellement ou dans le cadre des activités d'une entreprise
alternative label: entretien ménager et maintenance
alternative label: outils et équipement, entretien et maintenance
example: balai;savon;fer à repasser
preferred label: objet pour l'entretien ou la maintenance
scope note: Cette classe comprend les outils spécialisés utilisés pour la restauration et la conservation des objets.

Objet pour l’optique
type: Class
subclass of: Objet pour les sciences ou la technologie
source: https://nomenclature.info/nom/9943
source: https://www.musees.qc.ca/fr/professionnel/guidesel/doccoll/fr/classificationethno/classificationethnodefinition.htm#souscat5_23
comment: objet pour les sciences ou la technologie créé pour observer, mesurer ou documenter la lumière
alternative label: optique
alternative label: outils et équipement, optique
editorial note: Ici, le terme « optique » désigne la « branche de la physique qui a pour objet l'étude de la lumière et des phénomènes de la vision » (https://usito.usherbrooke.ca/d%C3%A9finitions/optique).
example: jumelles;microscope;loupe;spectrographe
preferred label: objet pour l'optique
scope note: Cette classe comprend l'équipement d’usage courant.

Objet pour l’étude de l’énergie thermique
type: Class
subclass of: Objet pour les sciences ou la technologie
source: https://nomenclature.info/nom/10235
source: https://www.musees.qc.ca/fr/professionnel/guidesel/doccoll/fr/classificationethno/classificationethnodefinition.htm#souscat5_15
comment: objet pour les sciences ou la technologie créé pour observer, mesurer ou documenter la chaleur et ses effets
alternative label: outils et équipement, énergie thermique
alternative label: énergie thermique
example: thermographe;bolomètre
preferred label: objet pour l'étude de l'énergie thermique

objet pour la mécanique
type: Class
subclass of: Objet pour les sciences ou la technologie
source: https://nomenclature.info/nom/9155
source: https://www.musees.qc.ca/fr/professionnel/guidesel/doccoll/fr/classificationethno/classificationethnodefinition.htm#souscat5_18
comment: objet pour les sciences ou la technologie créé pour l'étude, la mesure ou l'utilisation des propriétés statiques ou dynamiques des solides, des liquides et des gaz
label: Objet pour la mécanique @en
alternative label: outils et équipement, mécanique

Objet pour la métrologie
type: Class
subclass of: Objet pour les sciences ou la technologie
source: outils et équipement, métrologie
source: https://nomenclature.info/nom/10318
source: https://www.musees.qc.ca/fr/professionnel/guidesel/doccoll/fr/classificationethno/classificationethnodefinition.htm#souscat5_21
comment: objet pour les sciences ou la technologie créé pour observer, enregistrer ou mesurer des masses (poids) ou des dimensions physiques telles que la longueur, la surface ou le volume
alternative label: métrologie
example: balance de précision;règle pliante
preferred label: objet pour la métrologie

Objet pour la météorologie
type: Class
subclass of: Objet pour les sciences ou la technologie
source: https://nomenclature.info/nom/9856
source: https://www.musees.qc.ca/fr/professionnel/guidesel/doccoll/fr/classificationethno/classificationethnodefinition.htm#souscat5_20
comment: objet pour les sciences ou la technologie créé pour observer, mesurer ou documenter les phénomènes atmosphériques
alternative label: météorologie
alternative label: outils et équipement, météorologie
example: girouette;baromètre
preferred label: objet pour la météorologie

Objet pour la protection ou la répression
type: Class
subclass of: Objet pour les sciences ou la technologie
source: https://nomenclature.info/nom/10006
source: https://www.musees.qc.ca/fr/professionnel/guidesel/doccoll/fr/classificationethno/classificationethnodefinition.htm#souscat5_26
comment: objet pour les sciences ou la technologie créé pour contrôler le comportement des personnes ou assurer la sécurité ou la protection des biens
alternative label: outils et équipement, répression et protection
alternative label: protection civile
example: menottes;fouet;entrave
preferred label: objet pour la protection ou la répression
scope note: Cette classe comprend les objets servant à réaliser les activités courantes d'un organisme public telles que la protection contre l'incendie, la protection de l'ordre public assurée par les corps policiers et le processus électoral.

Objet pour le commerce
type: Class
subclass of: Objet pour les sciences ou la technologie
source: https://nomenclature.info/nom/9786
source: https://www.musees.qc.ca/fr/professionnel/guidesel/doccoll/fr/classificationethno/classificationethnodefinition.htm#souscat5_13
comment: objet pour les sciences ou la technologie créé pour faciliter ou permettre l'échange d'argent, de biens ou de services
alternative label: commerce
alternative label: outils et équipement, commerce
example: comptoir;baril;capsule;dame-jeanne
preferred label: objet pour le commerce
scope note: Cette classe comprend les objets servant à présenter des marchandises ainsi que des emballages de produits et des étiquettes.

Objet pour l’armement
type: Class
subclass of: Objet pour les sciences ou la technologie
source: https://nomenclature.info/nom/7734
comment: objet pour les sciences ou la technologie créé pour la chasse, le tir sur cibles, la guerre ou l'autoprotection
alternative label: Armement
preferred label: objet pour l'armement

Accessoire d’armement
type: Class
subclass of: Objet pour l’armement
source: https://nomenclature.info/nom/7807
source: https://www.musees.qc.ca/fr/professionnel/guidesel/doccoll/fr/classificationethno/classificationethnodefinition.htm#souscat5_9
comment: objet pour l'armement créé pour être utilisé comme accessoire pour la chasse, le tir sur cibles, la guerre ou l’autoprotection, ou comme objet utilisé pour l'entretien ou l'entreposage des armes
alternative label: accessoire et composant d'armement
alternative label: attirail
example: ceinture à cartouchière;cartouchière;ceinturon d'épée;amorces;fourreau;gibecière
preferred label: accessoire d’armement
scope note: Cette classe comprend les accessoires d'armes, d'artillerie ainsi que l'attirail personnel associé à l'armement.

Arme blanche
type: Class
subclass of: Objet pour l’armement
source: https://nomenclature.info/nom/8150
source: https://www.musees.qc.ca/fr/professionnel/guidesel/doccoll/fr/classificationethno/classificationethnodefinition.htm#souscat5_3
comment: objet pour l'armement créé pour être utilisé comme une arme qui tranche ou perce en tranchant
alternative label: armes blanches
example: baïonnette;arbalète
preferred label: arme blanche
scope note: Cette classe comprend notamment les baïonnettes servant d'accessoire aux armes à feu et les outils projetant des armes blanches.

Arme contondante
type: Class
subclass of: Objet pour l’armement
source: https://nomenclature.info/nom/8331
source: https://www.musees.qc.ca/fr/professionnel/guidesel/doccoll/fr/classificationethno/classificationethnodefinition.htm#souscat5_4
comment: objet pour l'armement créé pour être utilisé comme une arme qui frappe ou écrase par le poids ou la force d'impulsion, ou qui lance des projectiles non explosifs ou non pénétrants
alternative label: armes de percussion
example: garcette;massue
preferred label: arme contondante

Arme à feu
type: Class
subclass of: Objet pour l’armement
source: https://nomenclature.info/nom/8239
source: https://www.musees.qc.ca/fr/professionnel/guidesel/doccoll/fr/classificationethno/classificationethnodefinition.htm#souscat5_2
comment: objet pour l'armement créé pour être utilisé comme une arme qui tire des projectiles, pouvant être manié par une seule personne et qui généralement utilise un agent propulseur explosif
example: carabine;pistolet;tromblon
preferred label: arme à feu

Objet pour l’arpentage ou la navigation
type: Class
subclass of: Objet pour les sciences ou la technologie
source: https://nomenclature.info/nom/10098
source: https://www.musees.qc.ca/fr/professionnel/guidesel/doccoll/fr/classificationethno/classificationethnodefinition.htm#souscat5_6
comment: objet pour les sciences ou la technologie créé pour déterminer la position d'un observateur par rapport à des points de référence connus ou pour indiquer la forme et l'étendue d'une région, comme une surface terrestre
alternative label: arpentage et navigation
alternative label: outils et équipement, arpentage et navigation
example: sextant;théodolite
preferred label: objet pour l'arpentage ou la navigation
scope note: Cette classe comprend les instruments conçus pour prendre des mesures linéaires et angulaires.

Objet pour l’astronomie
type: Class
subclass of: Objet pour les sciences ou la technologie
source: https://nomenclature.info/nom/8354
source: https://www.musees.qc.ca/fr/professionnel/guidesel/doccoll/fr/classificationethno/classificationethnodefinition.htm#souscat5_8
comment: objet pour les sciences ou la technologie créé pour observer, mesurer ou documenter les objets et les événements hors de l'atmosphère terrestre
alternative label: astronomie
alternative label: outils et équipement, astronomie
example: astrolabe;télescope
preferred label: objet pour l'astronomie

Objet pour la communication
type: Class
subclass of: E22 Human-Made Object
source: https://nomenclature.info/nom/10378
source: https://usito.usherbrooke.ca/d%C3%A9finitions/communiquer
source: https://www.musees.qc.ca/fr/professionnel/guidesel/doccoll/fr/classificationethno/classificationethnodefinition.htm#Categorie6
comment: objet élaboré par l'humain créé pour permettre la communication, c'est-à-dire l'action de faire part, de donner connaissance de quelque chose à quelqu'un
alternative label: outillage et équipement pour la communication
hidden label: catégorie 06
hidden label: catégorie 6
preferred label: objet pour la communication

Objet pour la communication sonore
type: Class
subclass of: Objet pour la communication
source: https://nomenclature.info/nom/11153
source: https://www.musees.qc.ca/fr/professionnel/guidesel/doccoll/fr/classificationethno/classificationethnodefinition.htm#souscat6_2
comment: objet pour la communication créé pour générer, amplifier, reproduire ou stocker de la musique, des mots parlés ou d'autres sons utiles à la communication humaine, à l’exception des instruments de musique
alternative label: communication sonore
alternative label: outils et équipement, communication sonore
example: carillons;microphone;porte-voix
preferred label: objet pour la communication sonore

Objet pour la communication visuelle
type: Class
subclass of: Objet pour la communication
source: https://nomenclature.info/nom/11365
source: https://www.musees.qc.ca/fr/professionnel/guidesel/doccoll/fr/classificationethno/classificationethnodefinition.htm#souscat6_3
comment: objet pour la communication créé pour faciliter la communication au moyen de symboles, de motifs, de couleurs, de textes ou de photographies qui sont directement observables et intelligibles pour le destinataire, ou pour être utilisé comme appareil de signalisation, comme moyen de regarder des images photographiques ou d'autres types d'images
alternative label: communication visuelle
alternative label: outils et équipement, communication visuelle
example: feu de signalisation;projecteur de cinéma;projecteur de diapositives
preferred label: objet pour la communication visuelle

Objet pour la communication écrite
type: Class
subclass of: Objet pour la communication
source: https://nomenclature.info/nom/11446
source: https://www.musees.qc.ca/fr/professionnel/guidesel/doccoll/fr/classificationethno/classificationethnodefinition.htm#souscat6_1
comment: objet pour la communication créé pour faciliter la communication entre les personnes par l'intermédiaire de documents écrits, soit la préparation et la gestion de ces documents
alternative label: communication écrite
alternative label: outils et équipement, communication écrite
example: plume;encre;papier;agenda;pique-notes;sous-main
preferred label: objet pour la communication écrite

Objet pour la musique
type: Class
subclass of: Objet pour la communication
source: https://nomenclature.info/nom/10607
source: https://www.musees.qc.ca/fr/professionnel/guidesel/doccoll/fr/classificationethno/classificationethnodefinition.htm#souscat6_6
comment: objet pour la communication créé pour produire des sons musicaux ou pour être incorporés de façon audible dans des exécutions musicales
alternative label: musique
alternative label: outils et équipement, musique
example: piano;saxophone;violon
preferred label: objet pour la musique
scope note: Cette classe comprend les appareils utilisés de façon active dans l'exécution de la musique.

Accessoire musical
type: Class
subclass of: Objet pour la musique
source: https://nomenclature.info/nom/10608
comment: objet pour la musique créé pour faciliter la production de sons musicaux par des moyens manuels, mécaniques ou électroniques, mais qui ne produisent pas eux-mêmes de tels sons
alternative label: accessoires et composants musicaux
preferred label: accessoire musical

Instrument de musique
type: Class
subclass of: Objet pour la musique
source: https://nomenclature.info/nom/10655
comment: objet pour la musique créé pour produire des sons musicaux
alternative label: instruments de musique
preferred label: instrument de musique

Instrument à cordes
type: Class
equivalent class: Class
  intersection of: Instrument de musique
  intersection of: Restriction
    on property: est constitué de
    min qualified cardinality: 1
    on class: Class
subclass of: Instrument de musique
comment: instrument de musique dont le son résulte de la mise en vibration d'une ou de plusieurs cordes
preferred label: instrument à cordes

Instrument à vent
type: Class
subclass of: Instrument de musique
source: https://usito.usherbrooke.ca/d%C3%A9finitions/vent#bbb92dd19938e649
comment: instrument de musique dont le son résulte de la mise en vibration de la colonne d'air qu'il contient
preferred label: instrument à vent

Objet pour la photographie
type: Class
subclass of: Objet pour la communication
source: https://nomenclature.info/nom/10864
source: https://www.musees.qc.ca/fr/professionnel/guidesel/doccoll/fr/classificationethno/classificationethnodefinition.htm#souscat6_7
comment: objet pour la communication créé pour fixer une image permanente par des moyens optiques, chimiques ou numériques
alternative label: outils et équipement, photographie
alternative label: photographie
example: appareil photographique;cuve à développement;agrandisseur;filtre;trépied
preferred label: objet pour la photographie

Objet pour la télécommunication
type: Class
subclass of: Objet pour la communication
source: https://nomenclature.info/nom/11268
source: https://www.musees.qc.ca/fr/professionnel/guidesel/doccoll/fr/classificationethno/classificationethnodefinition.htm#souscat6_8
comment: objet pour la communication créé pour faciliter la communication à distance, par des moyens électriques ou électroniques
alternative label: outils et équipement, télécommunication
alternative label: télécommunication
example: téléphone;télégraphe;radio;téléviseur;câble;transmetteur;antenne
preferred label: objet pour la télécommunication

Objet pour le graphisme
type: Class
subclass of: Objet pour la communication
source: https://nomenclature.info/nom/10545
source: https://www.musees.qc.ca/fr/professionnel/guidesel/doccoll/fr/classificationethno/classificationethnodefinition.htm#souscat6_4
comment: objet pour la communication créé pour la création de dessins de précision, des plans architecturaux, des conceptions mécaniques, des cartes ou des graphiques
alternative label: graphisme
alternative label: outils et équipement, graphisme
example: équerre;table à dessin;compas;tire-ligne
preferred label: objet pour le graphisme
scope note: Cette classe comprend les instruments utilisés pour enregistrer les observations d'arpentage et de navigation.

Objet pour la manutention ou le transport
type: Class
subclass of: E22 Human-Made Object
source: https://nomenclature.info/nom/11633
source: https://www.musees.qc.ca/fr/professionnel/guidesel/doccoll/fr/classificationethno/classificationethnodefinition.htm#Categorie7
comment: objet élaboré par l'humain créé pour transporter des personnes ou des animaux ou pour distribuer des marchandises, ou pour faciliter ce transport ou en complément d'un tel transport
alternative label: objets de manutention et de transport
alternative label: transport et manutention
editorial note: Puisque l'équipement de transport est complexe et que les éléments sont souvent collectionnés de façon indépendante, certaines sous-classes sont subdivisées.
example: automobile;brouette
hidden label: catégorie 07
hidden label: catégorie 7
preferred label: objet pour la manutention ou le transport

Objet pour le transport ferroviaire
type: Class
subclass of: Objet pour la manutention ou le transport
source: https://nomenclature.info/nom/12262
source: https://www.musees.qc.ca/fr/professionnel/guidesel/doccoll/fr/classificationethno/classificationethnodefinition.htm#souscat7_4
comment: objet pour la manutention et le transport créé pour transporter des personnes ou des biens sur ou le long d'une route fixe déterminée par une voie, un rail, un câble ou un dispositif similaire, ou pour faciliter ce transport
alternative label: transport ferroviaire
alternative label: équipement de transport ferroviaire
example: locomotive;wagon
preferred label: objet pour le transport ferroviaire

Accessoire pour le transport ferroviaire
type: Class
subclass of: Objet pour le transport ferroviaire
source: https://nomenclature.info/nom/12263
source: https://www.musees.qc.ca/fr/professionnel/guidesel/doccoll/fr/classificationethno/classificationethnodefinition.htm#souscat7_5
comment: objet pour le transport ferroviaire créé comme accessoire pour le transport de personnes ou de biens sur ou le long d'une route fixe déterminée par une voie, un rail, un câble ou un dispositif similaire
alternative label: accessoires et composants de transport ferroviaire
alternative label: accessoires pour le transport ferroviaire
preferred label: accessoire pour le transport ferroviaire

Véhicule ferroviaire
type: Class
subclass of: Objet pour le transport ferroviaire
source: https://nomenclature.info/nom/12318
comment: objet pour le transport ferroviaire créé pour être utilisé comme moyen de transport sur ou le long d'une route fixe déterminée par une voie, un rail, un câble ou un dispositif similaire
preferred label: véhicule ferroviaire

Objet pour le transport maritime
type: Class
subclass of: Objet pour la manutention ou le transport
source: https://nomenclature.info/nom/12392
source: https://www.musees.qc.ca/fr/professionnel/guidesel/doccoll/fr/classificationethno/classificationethnodefinition.htm#souscat7_6
comment: objet pour la manutention ou le transport créé pour transporter des personnes ou des biens sur ou sous l'eau
alternative label: transport maritime
alternative label: équipement de transport maritime
example: canot;chaland;sous-marin
preferred label: objet pour le transport maritime

Accessoire pour le transport maritime
type: Class
subclass of: Objet pour le transport maritime
source: https://nomenclature.info/nom/12393
source: https://www.musees.qc.ca/fr/professionnel/guidesel/doccoll/fr/classificationethno/classificationethnodefinition.htm#souscat7_7
comment: objet pour le transport maritime créé comme accessoire pour le transport de personnes ou de biens sur ou sous l'eau
alternative label: accessoires et composants de transport maritime
alternative label: accessoires pour le transport maritime
example: cordage;cabestan;aviron;pompe
preferred label: accessoire pour le transport maritime
scope note: Cette classe comprend les objets créés pour faire partie des embarcations.

Embarcation
type: Class
subclass of: Objet pour le transport maritime
subclass of: Restriction
  on property: est manipulé par
  some values from: Aviron
source: https://vitrinelinguistique.oqlf.gouv.qc.ca/fiche-gdt/fiche/8879931/embarcation
comment: moyen de transport sur l'eau, de petite dimension
preferred label: embarcation

Objet pour le transport terrestre
type: Class
subclass of: Objet pour la manutention ou le transport
source: https://nomenclature.info/nom/11800
comment: objet pour la manutention ou le transport créé pour transporter des personnes ou des biens par voie terrestre sans restriction à un itinéraire fixe déterminé par un appareil de localisation ou autre dispositif de guidage
alternative label: outils et équipement, transport terrestre
preferred label: objet pour le transport terrestre

Véhicule à propulsion ou à traction humaine
type: Class
subclass of: Objet pour le transport terrestre
source: https://nomenclature.info/nom/12122
source: https://www.musees.qc.ca/fr/professionnel/guidesel/doccoll/fr/classificationethno/classificationethnodefinition.htm#souscat7_9
comment: objet pour le transport terrestre mû uniquement par l'énergie humaine
alternative label: transport terrestre à traction ou à propulsion humaine
alternative label: véhicules à traction ou à propulsion humaine
example: brancard;bicyclette;raquette
preferred label: véhicule à propulsion ou à traction humaine

Moyen d’expression
type: Class
subclass of: E22 Human-Made Object
source: https://nomenclature.info/nom/12838
source: https://www.musees.qc.ca/fr/professionnel/guidesel/doccoll/fr/classificationethno/classificationethnodefinition.htm#Categorie8
comment: objet élaboré par l'humain créé en tant qu'expression de la pensée humaine
alternative label: moyens d'expression
hidden label: catégorie 08
hidden label: catégorie 8
preferred label: moyen d'expression
scope note: Les moyens d'expression commentent, interprètent ou améliorent l'environnement des personnes, et peuvent fonctionner symboliquement ou littéralement.

Instrument d’échange
type: Class
subclass of: Moyen d’expression
source: https://nomenclature.info/nom/13807
source: https://www.musees.qc.ca/fr/professionnel/guidesel/doccoll/fr/classificationethno/classificationethnodefinition.htm#souscat8_3
comment: moyen d'expression créé pour être utilisé en tant qu'instrument d'échange ou en tant que moyen d'obtenir des biens et services particuliers
alternative label: monnaie d'échange
alternative label: monnaies d'échange
editorial note: Le terme « instrument d'échange » a été privilégié pour désigner cette classe plutôt que « monnaie d'échange » utilisé dans le Système de classification en ethnologie, histoire et archéologie du guide de documentation du Réseau Info-Muse (SMQ) et dans la norme Nomenclature pour le catalogage des objets de musée (RCIP). Le terme « instrument d'échange » désigne « tout ce qui est généralement accepté à titre de paiement, quel que soit le support ou le procédé technique utilisé, pour l'acquisition de biens ou de services ou pour le règlement d'une créance ou de tout autre engagement » (https://vitrinelinguistique.oqlf.gouv.qc.ca/fiche-gdt/fiche/503549/instrument-dechange). La monnaie constitue un type d'instrument d'échange. Ce terme correspond donc mieux à la portée de la définition de la classe, et donc, du concept.
example: pièce de monnaie;billet de banque;coquillage;timbre-poste;billet d'entrée;coupon de réduction;jeton;billet de métro
preferred label: instrument d’échange

Objet documentaire
type: Class
subclass of: Moyen d’expression
source: https://nomenclature.info/nom/13265
source: https://www.musees.qc.ca/fr/professionnel/guidesel/doccoll/fr/classificationethno/classificationethnodefinition.htm#souscat8_7
comment: moyen d'expression créé pour communiquer des informations à des personnes
alternative label: objets documentaires
alternative label: pièces et documents
preferred label: objet documentaire
scope note: Les objets documentaires présentent un point de vue, une image ou un ensemble d'idées, souvent dans le but d'éclairer ou d'influencer l'attitude des personnes.

Souvenir
type: Class
equivalent class: Class
  intersection of: Objet documentaire
  intersection of: Restriction
    on property: rappelle ou commémore
    some values from: E1 CRM Entity
subclass of: Objet documentaire
source: https://nomenclature.info/nom/13568
comment: objet documentaire symbolique en souvenir ou commémorant une personne, un lieu, un événement ou une expérience
alternative label: Souvenirs
preferred label: souvenir

Objet pour la cérémonie et le culte
type: Class
subclass of: Moyen d’expression
source: https://nomenclature.info/nom/12986
source: https://www.musees.qc.ca/fr/professionnel/guidesel/doccoll/fr/classificationethno/classificationethnodefinition.htm#souscat8_4
comment: moyen d'expression créé pour des activités gouvernementales, fraternelles, religieuses ou pour d'autres activités sociales organisées et sanctionnées, ou pour évoquer, symboliser ou exprimer certains aspects des traditions ou du patrimoine d'une communauté ou d'un groupe de personnes
alternative label: Objet de cérémonie et de culte
alternative label: Objets cérémoniels
example: coupe de communion;décoration d'autel;fanion
preferred label: objet pour la cérémonie et le culte
scope note: Les objets pour la cérémonie et le culte sont habituellement associés à des rituels ou à des cérémonies.

Objet du culte catholique
type: Class
subclass of: Objet pour la cérémonie et le culte
subclass of: Restriction
  on property: P103 was intended for
  some values from: Rite religieux
source: http://data.culture.fr/thesaurus/resource/ark:/67717/T69-1114
source: https://nomenclature.info/nom/13093
comment: objet pour la cérémonie et le culte créé pour être utilisé dans un culte religieux public ou des cérémonies spirituelles
comment: objet religieux lié à l'exercice ou à la pratique du culte catholique
label: Objet religieux
preferred label: objet du culte catholique
preferred label: objet religieux

Objet de dévotion du culte catholique
type: Class
subclass of: Objet du culte catholique
subclass of: Symbole personnel
source: http://data.culture.fr/thesaurus/resource/ark:/67717/T69-1592
comment: symbole personnel et objet du culte catholique bénit ou commémoratif suscitant la dévotion des fidèles ou lié à leurs pratiques privées en l’honneur de Dieu et des saints
preferred label: objet de dévotion du culte catholique

Objet pour les sacrements autres que l’Eucharistie
type: Class
equivalent class: Class
  intersection of: Objet du culte catholique
  intersection of: Class
    union of: Restriction
      on property: P103 was intended for
    union of: Restriction
      on property: P103 was intended for
    union of: Restriction
      on property: P103 was intended for
    union of: Restriction
      on property: P103 was intended for
    union of: Restriction
      on property: P103 was intended for
    union of: Restriction
      on property: P103 was intended for
subclass of: Objet du culte catholique
source: http://data.culture.fr/thesaurus/resource/ark:/67717/T69-1288
comment: objet du culte catholique, généralement à l'usage de l'officiant, lié à la préparation et à l'administration des sacrements autres que l'Eucharistie, soit le baptême, la confirmation, la réconciliation ou la pénitence, l'onction des malades, le mariage ou l'ordre
preferred label: objet pour les sacrements autres que l’Eucharistie

Objet pour l’ablution, l’aspersion ou l’encensement
type: Class
equivalent class: Class
  intersection of: Objet du culte catholique
  intersection of: Class
    union of: Restriction
      on property: P103 was intended for
    union of: Restriction
      on property: P103 was intended for
    union of: Restriction
      on property: P103 was intended for
subclass of: Objet du culte catholique
source: http://data.culture.fr/thesaurus/resource/ark:/67717/T69-702
comment: objet du culte catholique pouvant contenir l'eau nécessaire aux ablutions ou à l'aspersion et l'encens nécessaire à l'encensement
preferred label: objet pour l’ablution, l’aspersion ou l’encensement

Support publicitaire
type: Class
subclass of: Moyen d’expression
source: https://nomenclature.info/nom/12839
source: https://www.musees.qc.ca/fr/professionnel/guidesel/doccoll/fr/classificationethno/classificationethnodefinition.htm#souscat8_9
comment: moyen d'expression créé pour attirer l'attention du public sur un produit, un service ou un événement et pour susciter une réponse spécifique par rapport au produit, au service ou à l'événement
alternative label: Supports publicitaires
preferred label: support publicitaire
scope note: La réponse attendue est généralement d'inciter les personnes à acquérir, à utiliser ou à participer au produit, au service ou à l'événement annoncé.

Symbole personnel
type: Class
subclass of: Moyen d’expression
source: https://nomenclature.info/nom/13931
source: https://www.musees.qc.ca/fr/professionnel/guidesel/doccoll/fr/classificationethno/classificationethnodefinition.htm#souscat8_2
comment: moyen d'expression créé pour communiquer une croyance, une opinion, une réussite personnelle, un statut, un grade, une occupation, une appartenance ou une identité spécifique
alternative label: attribut
alternative label: symboles personnels
example: chevalière;toge;couronne;insigne;plaque de shako;amulette;cocarde;scalp
preferred label: symbole personnel
scope note: Un symbole personnel diffère d'un objet pour la cérémonie et le culte en ce qu'il exprime les idées individuelles, et non les idées d'un groupe, ou qu'il communique la relation des personnes à un groupe.

Œuvre visuelle
type: Class
subclass of: Moyen d’expression
source: https://nomenclature.info/nom/12895
comment: moyen d'expression créé comme œuvre décorative perçue par le sens de la vue
alternative label: arts visuels
hidden label: oeuvre visuelle
preferred label: œuvre visuelle

Objet récréatif ou sportif
type: Class
subclass of: E22 Human-Made Object
source: https://nomenclature.info/nom/14135
source: https://www.musees.qc.ca/fr/professionnel/guidesel/doccoll/fr/classificationethno/classificationethnodefinition.htm#Categorie9
comment: objet élaboré par l'humain créé pour être utilisé comme jouet, pour le jeu, les activités sportives, les jeux de hasard ou le divertissement du public
alternative label: objets récréatifs
alternative label: sport et divertissement
hidden label: catégorie 09
hidden label: catégorie 9
preferred label: objet récréatif ou sportif

Appareil récréatif
type: Class
subclass of: Objet récréatif ou sportif
source: https://nomenclature.info/nom/14351
source: https://www.musees.qc.ca/fr/professionnel/guidesel/doccoll/fr/classificationethno/classificationethnodefinition.htm#souscat9_2
comment: objet récréatif créé pour une activité participative, généralement non compétitive, autre qu'un jeu ou un exercice athlétique
alternative label: appareils récréatifs
alternative label: équipement récréosportif
example: billard électrique;glissoire;balançoire;carrousel
preferred label: appareil récréatif
scope note: Cette classse comprend l'équipement de divertissement, que cet équipement soit propriété publique ou privée et qu'il y ait ou non des frais reliés à son utilisation.

Jouet
type: Class
subclass of: Objet récréatif ou sportif
source: https://nomenclature.info/nom/14709
source: https://usito.usherbrooke.ca/d%C3%A9finitions/jouet
source: https://www.cnrtl.fr/definition/jouet
source: https://www.musees.qc.ca/fr/professionnel/guidesel/doccoll/fr/classificationethno/classificationethnodefinition.htm#souscat9_5
comment: objet récréatif créé pour s'amuser, généralement utilisé par les enfants
alternative label: jouets
example: poupée;animal en peluche;balle;toupie;cerf-volant;bilboquet;cube;cerceau
preferred label: jouet
scope note: Les jouets représentent des objets fonctionnels ou des choses vivantes, et incluent également les objets conçus principalement pour le jeu.

Objet pour le divertissement du public
type: Class
subclass of: Objet récréatif ou sportif
source: https://nomenclature.info/nom/14289
source: https://www.musees.qc.ca/fr/professionnel/guidesel/doccoll/fr/classificationethno/classificationethnodefinition.htm#souscat9_1
comment: objet récréatif créé pour la présentation d’un divertissement non compétitif devant des spectateurs
alternative label: appareils de divertissement public
alternative label: équipement récréoculturel
example: trapèze;masque
preferred label: objet pour le divertissement du public

Objet pour le jeu
type: Class
subclass of: Objet récréatif ou sportif
source: https://nomenclature.info/nom/14136
source: https://www.musees.qc.ca/fr/professionnel/guidesel/doccoll/fr/classificationethno/classificationethnodefinition.htm#souscat9_4
comment: objet récréatif créé pour une activité compétitive fondée sur le hasard, la résolution de problème ou le calcul, plutôt que sur un effort physique intense, et qui se déroule selon des règles établies
alternative label: équipement pour le jeu
example: domino;bille;jeu de cartes
preferred label: objet pour le jeu

Accessoire de jeu
type: Class
subclass of: Objet pour le jeu
source: https://nomenclature.info/nom/15185
comment: objet pour le jeu créé pour le faciliter
alternative label: accessoires et composants de jeu
preferred label: accessoire de jeu

Composant d’objet
type: Class
subclass of: E24 Physical Human-Made Thing
comment: chose matérielle élaborée par l'humain faisant partie d'un objet et ayant une propriété fonctionnelle
preferred label: composant d'objet

Composant de meuble
type: Class
equivalent class: Class
  intersection of: Composant d’objet
  intersection of: Restriction
    on property: fait partie de
    all values from: Meuble
subclass of: Composant d’objet
comment: composant d'objet faisant partie d'un meuble et ayant une propriété fonctionnelle
preferred label: composant de meuble

Composant d’armement
type: Class
equivalent class: Class
  intersection of: Composant d’objet
  intersection of: Restriction
    on property: fait partie de
    all values from: Objet pour l’armement
subclass of: Composant d’objet
comment: composant d'objet faisant partie d'un objet pour l'armement et ayant une propriété fonctionnelle
preferred label: composant d'armement

Composant d’objet à usage polyvalent
type: Class
subclass of: Composant d’objet
comment: composant d'objet utilisé dans différents contextes d'usage possibles
preferred label: composant d'objet à usage polyvalent

Composant musical
type: Class
equivalent class: Class
  intersection of: Composant d’objet
  intersection of: Restriction
    on property: fait partie de
    all values from: Objet pour la musique
subclass of: Composant d’objet
comment: composant d'objet faisant partie d'un objet pour la musique et ayant une propriété fonctionnelle
preferred label: composant musical

Composant vestimentaire
type: Class
equivalent class: Class
  intersection of: Composant d’objet
  intersection of: Restriction
    on property: fait partie de
    all values from: Vêtement
subclass of: Composant d’objet
comment: composant d'objet faisant partie d'un vêtement et ayant une propriété fonctionnelle
preferred label: composant vestimentaire

Procédé ou technique de construction textile
type: Class
subclass of: Procédé ou technique
source: http://vocab.getty.edu/page/aat/300239729
comment: procédé ou technique permettant de concevoir des produits à partir de fibres ou de matières textiles
preferred label: procédé ou technique de construction textile

Procédé ou technique de création d’images
type: Class
subclass of: Procédé ou technique
source: http://vocab.getty.edu/page/aat/300053159
comment: procédé ou technique permettant de produire ou reproduire des images
preferred label: procédé ou technique de création d’images

Procédé ou technique d’impression
type: Class
subclass of: Procédé ou technique de création d’images
source: http://vocab.getty.edu/page/aat/300053319
source: https://usito.usherbrooke.ca/d%C3%A9finitions/impression
source: https://www.cnrtl.fr/definition/impression
comment: procédé ou technique de reproduction par pression ou contact d'une surface, généralement une plaque, un bloc, une pierre ou un écran, portant des traces enduites d'encre correspondant à une image picturale ou textuelle sur une autre, généralement en papier ou en tissu, qui en reçoit l'empreinte
preferred label: procédé ou technique d’impression

Insecte
type: Class
subclass of: Animal
source: https://usito.usherbrooke.ca/d%C3%A9finitions/insecte
comment: petit animal invertébré de type arthropode, pourvu de deux antennes, de trois paires de pattes et, chez la plupart des espèces, d’une ou de deux paires d’ailes, dont le corps présente trois parties principales bien distinctes (la tête, le thorax et l’abdomen) et dont le développement complet comporte généralement différents stades (larve, nymphe, adulte) et d’importantes métamorphoses
preferred label: insecte

Accordéon
type: Class
equivalent class: Class
  intersection of: Instrument à vent
  intersection of: Class
    union of: Restriction
      on property: est constitué de
      some values from: Métal
    union of: Restriction
      on property: est constitué de
      some values from: Bois
  intersection of: Restriction
    on property: comprend
    all values from: Anche
  intersection of: Restriction
    on property: a pour accessoire
  intersection of: Restriction
    on property: comprend
  intersection of: Restriction
    on property: comprend
  intersection of: Restriction
    on property: est constitué de
subclass of: Instrument à vent
source: https://nomenclature.info/nom/10708
source: https://vitrinelinguistique.oqlf.gouv.qc.ca/fiche-gdt/fiche/17058634/accordéon
comment: instrument à vent composé de deux boîtiers rectangulaires en bois ou en métal reliés par un soufflet extensible en cuir, chacun munis à l'intérieur de plusieurs anches en métal reliées à l'extérieur à un clavier à touches et à boutons, généralement avec des bretelles en cuir, et servant à produire des sons et des accords par l'action de l'air du soufflet et la pression des touches ou des boutons sur les anches libres
preferred label: accordéon

Affiche
type: Class
subclass of: Support publicitaire
subclass of: Restriction
  on property: a pour support
  some values from: Papier
subclass of: Restriction
  on property: résulte de
  all values from: Procédé ou technique d’impression
source: https://usito.usherbrooke.ca/d%C3%A9finitions/affiche
source: https://www.cnrtl.fr/definition/affiche
comment: support publicitaire constitué d'une feuille de papier imprimée destinée à être placardée sur un mur ou un emplacement public réservé, et servant à donner à un large public une information de nature officielle ou publicitaire
preferred label: affiche

Aiguière baptismale
type: Class
equivalent class: Class
  intersection of: Objet pour les sacrements autres que l’Eucharistie
  intersection of: Restriction
    on property: P103 was intended for
  intersection of: Restriction
    on property: a pour contenu
  intersection of: Restriction
    on property: comprend
  intersection of: Restriction
    on property: comprend
subclass of: Objet pour les sacrements autres que l’Eucharistie
source: http://data.culture.fr/thesaurus/page/ark:/67717/T69-1349
comment: récipient, avec anse et bec, servant à verser l'eau baptismale pour l'administration du baptême
preferred label: aiguière baptismale

Album de photographies
type: Class
equivalent class: Class
  intersection of: Album
  intersection of: Restriction
    on property: est composé de
    all values from: Photographie
subclass of: Album
comment: album contenant des photographies avec ou sans informations quant à leur identification
alternative label: album de photos
alternative label: album photos
preferred label: album de photographies

Arc
type: Class
equivalent class: Class
  intersection of: Objet pour l’armement
  intersection of: Class
    union of: Restriction
      on property: est constitué de
      some values from: Métal
    union of: Restriction
      on property: est constitué de
      some values from: Bois
    union of: Restriction
      on property: est constitué de
  intersection of: Restriction
    on property: permet de manipuler
    some values from: Flèche
  intersection of: Restriction
    on property: comprend
  intersection of: Restriction
    on property: comprend
subclass of: Arme blanche
source: https://usito.usherbrooke.ca/d%C3%A9finitions/arc
source: https://www.cnrtl.fr/definition/arc
comment: arme blanche composée d'une tige de bois, de métal ou de fibre de verre fortement recourbée par une corde fixée à ses deux extrémités, servant à lancer des flèches
preferred label: arc

Assiette à déjeuner
type: Class
subclass of: Assiette
source: https://nomenclature.info/nom/4872
comment: assiette, plus petite qu'une assiette plate, servant à mettre ou recevoir de la nourriture à table, au repas du midi
alternative label: assiette à déjeûner
preferred label: assiette à déjeuner

Assiette à dessert
type: Class
subclass of: Assiette
source: http://vocab.getty.edu/page/aat/300196492
source: https://nomenclature.info/nom/4867
comment: assiette, plus petite qu'une assiette plate utilisée au moment du plat principal, servant à mettre ou recevoir de la nourriture à table, lors du moment du repas où est servi le dessert
hidden label: assiette à desserts
preferred label: assiette à dessert

Assiette commémorative
type: Class
subclass of: Souvenir
subclass of: Class
  union of: Restriction
    on property: P62 depicts
    some values from: E21 Person
  union of: Restriction
    on property: P62 depicts
    some values from: E53 Place
  union of: Restriction
    on property: P62 depicts
    some values from: E5 Event
source: http://vocab.getty.edu/page/aat/300423508
source: https://nomenclature.info/nom/4867
comment: souvenir ayant la forme d'une assiette orné de l'image d'un événement, d'un lieu ou d'une personne que l'on souhaite commémorer, destiné à être collectionnée ou accrochée comme décoration, plutôt que pour contenir des aliments lors d'un repas
preferred label: assiette commémorative
scope note: Bien que l'assiette commémorative ait la forme d'une assiette destinée au service des aliments, on ne peut la classifier comme telle étant donné que la classification des objets ici préconisée repose d'abord sur leur utilisation prévue.

Baignoire
type: Class
subclass of: Appareil sanitaire
subclass of: Class
  union of: Restriction
    on property: est constitué de
    some values from: Porcelaine
  union of: Restriction
    on property: est constitué de
  union of: Restriction
    on property: est constitué de
subclass of: Restriction
  on property: comprend
subclass of: Restriction
  on property: comprend
source: https://nomenclature.info/nom/282
source: https://usito.usherbrooke.ca/d%C3%A9finitions/baignoire
source: https://www.cnrtl.fr/definition/baignoire
comment: appareil sanitaire en forme de cuve allongée alimentée par un réservoir ou par l'eau courante, en porcelaine, en cuivre, ou en fonte émaillée, comportant un trou d'écoulement et généralement munie d'un bord et de pieds, servant à prendre des bains
preferred label: baignoire

Bassine
type: Class
subclass of: Objet pour le traitement des aliments
subclass of: Restriction
  on property: est constitué de
  all values from: Métal
subclass of: Restriction
  on property: comprend
source: https://vitrinelinguistique.oqlf.gouv.qc.ca/fiche-gdt/fiche/2085689/bassine
source: https://www.cnrtl.fr/definition/bassine
comment: large récipient circulaire, généralement muni de deux poignées, uniquement en métal, servant à la cuisson de différents aliments, et dont la forme peut varier selon l'emploi auquel la bassine est destinée
preferred label: bassine

Bénitier
type: Class
equivalent class: Class
  intersection of: Objet pour l’ablution, l’aspersion ou l’encensement
  intersection of: Restriction
    on property: fait partie de
    some values from: Église
  intersection of: Restriction
    on property: P103 was intended for
  intersection of: Restriction
    on property: a pour contenu
subclass of: Objet pour l’ablution, l’aspersion ou l’encensement
source: http://data.culture.fr/thesaurus/resource/ark:/67717/T69-703
comment: objet pour l'aspersion et vase situé, selon les prescriptions liturgiques, près d'une entrée d'église et remplie d'eau bénite avec laquelle les fidèles se signent
preferred label: bénitier

Billet de banque
type: Class
subclass of: Instrument d’échange
subclass of: Class
  union of: Restriction
    on property: est constitué de
    some values from: Papier
  union of: Restriction
    on property: est constitué de
    some values from: Polymère synthétique
  union of: Restriction
    on property: est constitué de
subclass of: Restriction
  on property: résulte de
  all values from: Procédé ou technique d’impression
source: https://nomenclature.info/nom/13881
source: https://usito.usherbrooke.ca/d%C3%A9finitions/billet#b5b8BAd54451e161
source: https://vitrinelinguistique.oqlf.gouv.qc.ca/fiche-gdt/fiche/8381263/billet-de-banque
comment: instrument d'échange en papier, carton ou polymère synthétique, imprimé sur les deux faces, émis et garanti par un État par le biais de sa banque centrale, servant d'unité de valeur monétaire
preferred label: billet de banque
synonyme: papier-monnaie

Boîte à chapeau
type: Class
equivalent class: Class
  intersection of: Article personnel
  intersection of: Class
    intersection of: Class
      intersection of: Restriction
        on property: comprend
      intersection of: Restriction
        on property: comprend
      intersection of: Restriction
        on property: comprend
      intersection of: Restriction
        on property: comprend
    intersection of: Class
      union of: Restriction
        on property: est constitué de
        some values from: Tissu
      union of: Restriction
        on property: est constitué de
    intersection of: Restriction
      on property: a pour contenu
      some values from: Chapeau
  intersection of: Class
    union of: Restriction
      on property: est constitué de
      some values from: Métal
    union of: Restriction
      on property: est constitué de
      some values from: Bois
  intersection of: Restriction
    on property: est constitué de
    some values from: Papier
subclass of: Article personnel
source: https://nomenclature.info/nom/2879
comment: boîte en cuir, en bois ou en métal, de formes diverses, généralement doublé de papier, tissu ou cuir, parfois muni de compartiments, d’un couvercle, d’une poignée, d’une courroie de fermeture et parfois d’une serrure, servant à protéger, à ranger et à transporter un chapeau
preferred label: boîte à chapeau

Botte
type: Class
subclass of: Chaussure
subclass of: Class
  union of: Restriction
    on property: est constitué de
    some values from: Tissu
  union of: Restriction
    on property: est constitué de
    some values from: Fourrure
  union of: Restriction
    on property: est constitué de
  union of: Restriction
    on property: est constitué de
source: https://nomenclature.info/nom/2145
source: https://vitrinelinguistique.oqlf.gouv.qc.ca/fiche-gdt/fiche/2099969/botte
comment: chaussure en cuir, en caoutchouc, en fourrure, en vinyle, ou en tissu, dont la tige, de longueur variable, monte au moins jusqu'au mollet et peut couvrir le genou et même la cuisse, servant à protéger le pied ou la jambe de l'humidité et du froid
preferred label: botte

Boussole
type: Class
subclass of: Objet pour l’arpentage ou la navigation
subclass of: Restriction
  on property: comprend
subclass of: Restriction
  on property: comprend
source: https://usito.usherbrooke.ca/d%C3%A9finitions/boussole
source: https://vitrinelinguistique.oqlf.gouv.qc.ca/fiche-gdt/fiche/8981712/boussole
comment: instrument comportant un cadran muni d'une aiguille mobile aimantée dont, lorsqu'au repos, une extrémité indique le nord magnétique terrestre
preferred label: boussole

Bouteille
type: Class
subclass of: Objet pour le commerce
subclass of: Class
  union of: Restriction
    on property: comprend
  union of: Restriction
    on property: comprend
subclass of: Restriction
  on property: est constitué de
  some values from: Verre
source: https://usito.usherbrooke.ca/d%C3%A9finitions/bouteille
source: https://vitrinelinguistique.oqlf.gouv.qc.ca/fiche-gdt/fiche/8353094/bouteille
comment: récipient, généralement en verre, à goulot étroit, fermant avec un bouchon ou un couvercle, servant à contenir et transporter un liquide
preferred label: bouteille

Bouteille de bière
type: Class
equivalent class: Class
  intersection of: Bouteille
  intersection of: Restriction
    on property: a pour contenu
subclass of: Bouteille
comment: bouteille servant à contenir et transporter de la bière
alternative label: bouteille à bière
preferred label: bouteille de bière

Brassard
type: Class
subclass of: Symbole personnel
subclass of: Restriction
  on property: est constitué de
  some values from: Étoffe
source: https://usito.usherbrooke.ca/d%C3%A9finitions/brassard
source: https://www.cnrtl.fr/definition/brassard
comment: bande d'étoffe portée au bras comme signe distinctif
preferred label: brassard

Broderie
type: Class
equivalent class: Class
  intersection of: Œuvre visuelle
  intersection of: Class
    union of: Class
      intersection of: Restriction
        on property: est constitué de
        some values from: Laine (fibre)
      intersection of: Restriction
        on property: P62 depicts
        all values from: E1 CRM Entity
      intersection of: Restriction
        on property: résulte de
    union of: Restriction
      on property: est constitué de
      some values from: Soie (fibre)
    union of: Restriction
      on property: est constitué de
    union of: Restriction
      on property: est constitué de
    union of: Restriction
      on property: est constitué de
  intersection of: Class
    union of: Class
      intersection of: Restriction
        on property: est constitué de
      intersection of: Restriction
        on property: a pour support
    union of: Restriction
      on property: a pour support
      some values from: Papier
    union of: Restriction
      on property: a pour support
      some values from: Tissu
subclass of: Œuvre visuelle
source: https://nomenclature.info/nom/12916
source: https://usito.usherbrooke.ca/d%C3%A9finitions/broderie
source: https://www.cnrtl.fr/definition/broderie
comment: œuvre visuelle, caractérisée par un motif ou un dessin constitué de points créés avec des fils (de coton, de soie, d'or, d'argent ou de laine), généralement brodé sur du tissu, mais aussi sur du cuir, du papier ou un autre support
preferred label: broderie

Buste
type: Class
equivalent class: Class
  intersection of: Sculpture
  intersection of: Restriction
    on property: P62 depicts
    all values from: E21 Person
subclass of: Sculpture
source: https://nomenclature.info/nom/12957
comment: sculpture représentant la tête, les épaules et une partie du torse d’une personne
preferred label: buste

Bustier
type: Class
subclass of: Sous-vêtement
source: https://usito.usherbrooke.ca/d%C3%A9finitions/bustier
source: https://vitrinelinguistique.oqlf.gouv.qc.ca/fiche-gdt/fiche/2073158/bustier
source: https://www.cnrtl.fr/definition/bustier
comment: sous-vêtement féminin dépourvu de bretelles, servant à soutenir et emboîter le buste, de la poitrine à la taille
preferred label: bustier

Cache-pot
type: Class
subclass of: Accessoire ménager
subclass of: Restriction
  on property: est constitué de
source: https://nomenclature.info/nom/1499
source: https://usito.usherbrooke.ca/d%C3%A9finitions/cache-pot
source: https://www.cnrtl.fr/definition/cache-pot
comment: vase ornemental, de dimensions et de matériaux variés, parfois muni de poignées, servant à dissimuler un pot de plante de façon esthétique
preferred label: cache-pot

Caméra
type: Class
subclass of: Objet pour la photographie
subclass of: Restriction
  on property: permet de manipuler
source: https://usito.usherbrooke.ca/d%C3%A9finitions/cam%C3%A9ra
source: https://vitrinelinguistique.oqlf.gouv.qc.ca/fiche-gdt/fiche/26543728/camera
comment: appareil de prises de vues servant à l'enregistrement sur pellicule ou sur support numérique de plusieurs images photographiques successives et rapprochées dans le temps
preferred label: caméra

Canne
type: Class
subclass of: Article personnel
subclass of: Class
  union of: Restriction
    on property: est constitué de
    some values from: Métal
  union of: Restriction
    on property: est constitué de
    some values from: Bois
subclass of: Restriction
  on property: comprend
subclass of: Restriction
  on property: comprend
source: https://usito.usherbrooke.ca/d%C3%A9finitions/canne_1
source: https://vitrinelinguistique.oqlf.gouv.qc.ca/fiche-gdt/fiche/8892962/canne
source: https://www.cnrtl.fr/definition/canne
comment: bâton en bois ou en métal à l’extrémité le plus souvent recourbée ou muni d'une poignée, servant d'appui à une personne qui marche
preferred label: canne

Canot
type: Class
subclass of: Embarcation
subclass of: Restriction
  on property: est manipulé par
  all values from: Pagaie simple
source: https://usito.usherbrooke.ca/d%C3%A9finitions/canot
source: https://vitrinelinguistique.oqlf.gouv.qc.ca/fiche-gdt/fiche/2079485/canot
comment: embarcation d'origine autochtone légère non pontée, de forme longiligne, effilée aux deux extrémités et propulsée à la pagaie simple, en position assise ou agenouillée
preferred label: canot

Cape
type: Class
subclass of: Vêtement de dessus
subclass of: Restriction
  on property: comprend
subclass of: Restriction
  on property: comprend
subclass of: Restriction
  on property: comprend
source: https://nomenclature.info/nom/2544
source: https://usito.usherbrooke.ca/d%C3%A9finitions/cape
source: https://vitrinelinguistique.oqlf.gouv.qc.ca/fiche-gdt/fiche/2073722/cape
comment: vêtement d'extérieur ample de longueur variable, dépourvu de manches et d'emmanchures, couvrant le corps et les bras, fermé au milieu du devant, sur toute sa longueur ou seulement à l’encolure, comportant parfois un capuchon, un col et des passe-bras, servant à protéger contre les intempéries et le froid
preferred label: cape

Carte postale
type: Class
subclass of: Objet pour la communication écrite
subclass of: Restriction
  on property: est constitué de
  all values from: Papier
source: https://usito.usherbrooke.ca/d%C3%A9finitions/carte
source: https://vitrinelinguistique.oqlf.gouv.qc.ca/fiche-gdt/fiche/3499792/carte-postale
comment: objet de correspondance sans enveloppe, consistant en une feuille de papier fort et rigide, dont l'une des faces est entièrement réservée à la correspondance, la moitié droite au moins de l'autre face (recto selon la terminologie postale) étant réservée à l'adresse du destinataire, à l'affranchissement et aux indications postales
preferred label: carte postale

Console de jeu
type: Class
equivalent class: Class
  intersection of: Accessoire de jeu
  intersection of: Restriction
    on property: permet de manipuler
    all values from: Jeu vidéo
subclass of: Accessoire de jeu
source: https://usito.usherbrooke.ca/d%C3%A9finitions/console#bbD58f29d9958e87
source: https://vitrinelinguistique.oqlf.gouv.qc.ca/fiche-gdt/fiche/8375461/console-de-jeu
comment: matériel informatique autonome ou non et d'apparence diverse, servant à l'exécution de jeux vidéo
preferred label: console de jeu
synonyme: console de jeu vidéo

Casse-tête (arme contondante)
type: Class
subclass of: Massue
subclass of: Class
  union of: Restriction
    on property: est constitué de
    some values from: Bois
  union of: Restriction
    on property: est constitué de
    some values from: Pierre
source: https://usito.usherbrooke.ca/d%C3%A9finitions/casse-t%C3%Aate
comment: massue en bois ou en pierre utilisée comme arme guerrière par certaines peuplades
preferred label: casse-tête

Ceinture fléchée
type: Class
equivalent class: Class
  intersection of: Ceinture
  intersection of: Restriction
    on property: est constitué de
    some values from: Laine (fibre)
  intersection of: Restriction
    on property: a pour motif
  intersection of: Restriction
    on property: comprend
  intersection of: Restriction
    on property: résulte de
  intersection of: Restriction
    on property: résulte de
subclass of: Ceinture
source: https://usito.usherbrooke.ca/d%C3%A9finitions/ceinture#BABd6Ed11134e115
source: https://vitrinelinguistique.oqlf.gouv.qc.ca/fiche-gdt/fiche/8870000/ceinture-flechee
comment: longue et large ceinture d'apparat traditionnelle d'origine canadienne-française, en laine tissée selon la technique du fléché, à motifs colorés en forme de flèches (chevrons) et dont les extrémités sont bloquées par des franges torsadées
preferred label: ceinture fléchée

Buffet
type: Class
subclass of: Meuble
source: https://usito.usherbrooke.ca/d%C3%A9finitions/buffet
source: https://www.cnrtl.fr/definition/buffet
comment: meuble, parfois composé de deux corps superposés, servant à ranger la vaisselle, le linge de table, certaines provisions, etc.
preferred label: buffet

Chalumeau
type: Class
equivalent class: Class
  intersection of: Objet pour le traitement des aliments
  intersection of: Class
    intersection of: Restriction
      on property: comprend
    intersection of: Restriction
      on property: permet de traiter
  intersection of: Class
    union of: Restriction
      on property: est constitué de
      some values from: Métal
    union of: Restriction
      on property: est constitué de
      some values from: Bois
subclass of: Objet pour le traitement des aliments
source: https://nomenclature.info/nom/4672
source: https://usito.usherbrooke.ca/d%C3%A9finitions/chalumeau
source: https://www.dhfq.org/article/chalumeau
comment: tube en bois ou en métal effilé à une extrémité, parfois muni d'un crochet en métal, servant à faciliter l'écoulement de l'eau d'érable de l'entaille d'un érable à sucre à un seau ou à une tubulure d'un système de collecte
preferred label: chalumeau
synonyme: chalumeau à sève

Chandelier
type: Class
subclass of: Objet pour l’éclairage
subclass of: Restriction
  on property: comprend
  some values from: Bobèche
subclass of: Restriction
  on property: comprend
subclass of: Restriction
  on property: comprend
source: https://usito.usherbrooke.ca/d%C3%A9finitions/chandelier
source: https://www.cnrtl.fr/definition/chandelier
comment: ustensile généralement constitué d'un pied, d'une tige pouvant se diviser en plusieurs branches, d'une bobèche ou d'une cuvette surmontée d'une pointe, servant de support aux chandelles, aux cierges et aux bougies
preferred label: chandelier
synonyme: flambeau

Chapeau
type: Class
equivalent class: Class
  intersection of: Coiffure
  intersection of: Class
    intersection of: Restriction
      on property: comprend
    intersection of: Restriction
      on property: comprend
subclass of: Coiffure
source: https://nomenclature.info/nom/2272
source: https://usito.usherbrooke.ca/d%C3%A9finitions/chapeau
source: https://vitrinelinguistique.oqlf.gouv.qc.ca/fiche-gdt/fiche/2073696/chapeau
comment: coiffure rigide, de matière et de forme variables, composée d’une calotte et généralement d'un rebord, parfois décorée, servant à protéger la tête contre les éléments ou à compléter la tenue vestimentaire selon les convenances
preferred label: chapeau

Chapelet
type: Class
subclass of: Objet de dévotion du culte catholique
subclass of: Class
  union of: Restriction
    on property: comprend
  union of: Restriction
    on property: comprend
source: http://data.culture.fr/thesaurus/resource/ark:/67717/T69-1620
source: https://usito.usherbrooke.ca/d%C3%A9finitions/chapelet
comment: objet de dévotion composé de grains disposés sur une chaîne ou un fil fermé, généralement organisés en cinq séries de dix petits grains (dizaines) séparées par un plus gros, auquel est suspendue une autre série de trois petits grains entourés de deux gros et terminée par une croix, servant à compter les prières à réciter
preferred label: chapelet

Chasse-neige
type: Class
equivalent class: Class
  intersection of: Accessoire pour le transport ferroviaire
  intersection of: Class
    intersection of: Restriction
      on property: est accessoire de
      all values from: Locomotive
    intersection of: Restriction
      on property: est constitué de
      max qualified cardinality: 2
      on class: Class
  intersection of: Restriction
    on property: est constitué de
    min qualified cardinality: 1
    on class: Class
subclass of: Accessoire pour le transport ferroviaire
source: https://usito.usherbrooke.ca/d%C3%A9finitions/chasse-neige
source: https://vitrinelinguistique.oqlf.gouv.qc.ca/fiche-gdt/fiche/26504291/chasse-neige
source: https://www.cnrtl.fr/definition/chasse-neige
comment: matériel roulant constitué d'une ou deux grandes lames biaises que l'on adapte à l'avant une locomotive, servant à déneiger la voie ferrée
preferred label: chasse-neige

Cheminée
type: Class
subclass of: Construction
subclass of: Restriction
  on property: fait partie de
  some values from: Construction
source: https://usito.usherbrooke.ca/d%C3%A9finitions/chemin%C3%A9e
source: https://vitrinelinguistique.oqlf.gouv.qc.ca/fiche-gdt/fiche/26542017/cheminee
comment: construction et conduit faisant partie d'un bâtiment, servant à évacuer la fumée et les gaz associés à la combustion
preferred label: cheminée

Cheval à bascule
type: Class
subclass of: Jouet
subclass of: Restriction
  on property: P62 depicts
source: https://usito.usherbrooke.ca/d%C3%A9finitions/cheval#D9106fd46788e706
comment: jouet d'enfant berçant en forme de cheval
preferred label: cheval à bascule

Cloche
type: Class
subclass of: Objet pour la communication sonore
subclass of: Restriction
  on property: est constitué de
  all values from: Métal
source: https://usito.usherbrooke.ca/d%C3%A9finitions/cloche_1
comment: instrument en métal, creux et évasé, dont on tire des sons en frappant ses parois, à l'intérieur avec un battant ou à l'extérieur avec un marteau
preferred label: cloche

Compas
type: Class
subclass of: Objet pour la métrologie
subclass of: Objet pour le graphisme
subclass of: Class
  union of: Restriction
    on property: comprend
    some values from: Crayon
  union of: Restriction
    on property: comprend
    some values from: Tire-ligne
subclass of: Restriction
  on property: est constitué de
  all values from: Métal
subclass of: Restriction
  on property: comprend
source: https://usito.usherbrooke.ca/d%C3%A9finitions/compas
source: https://vitrinelinguistique.oqlf.gouv.qc.ca/fiche-gdt/fiche/17012301/compas
source: https://www.cnrtl.fr/definition/compas
comment: instrument composé de deux branches articulées à une extrémité, dont l'une se termine par une pointe en métal et l'autre peut porter une pointe, un crayon ou un tire-ligne, servant à dessiner des cercles ou à reporter des longueurs
preferred label: compas

Corne à poudre
type: Class
equivalent class: Class
  intersection of: Accessoire d’armement
  intersection of: Class
    union of: Restriction
      on property: a pour contenu
    union of: Restriction
      on property: a pour contenu
  intersection of: Class
    union of: Restriction
      on property: est constitué de
    union of: Restriction
      on property: est constitué de
subclass of: Accessoire d’armement
source: http://vocab.getty.edu/page/aat/300225671
comment: récipient portable en forme de corne, généralement en corne de vache ou de boeuf, servant à transporter de la poudre d'amorçage ou de la poudre à canon
preferred label: corne à poudre

Couverture
type: Class
subclass of: Literie
subclass of: Class
  union of: Restriction
    on property: est constitué de
    some values from: Laine (fibre)
  union of: Restriction
    on property: est constitué de
  union of: Restriction
    on property: est constitué de
subclass of: Restriction
  on property: a pour motif
  some values from: Motif
source: https://nomenclature.info/nom/986
source: https://usito.usherbrooke.ca/d%C3%A9finitions/couverture
source: https://www.cnrtl.fr/definition/couverture
comment: pièce de tissu avec ou sans motif, rectangulaire, de grande taille, en laine, en coton ou en flanellette, que l'on place sur le drap de dessus, servant à couvrir et à protéger du froid et des intempéries
preferred label: couverture
synonyme: couverte

Cube de Leslie
type: Class
subclass of: Objet pour l’étude de l’énergie thermique
source: https://babelnet.org/synset
source: https://fr.wikipedia.org/wiki/Cube_de_Leslie
comment: dispositif utilisé dans la démonstration et la mesure des variations de l'énergie de radiation selon la surface des corps
preferred label: cube de Leslie

Scie égoïne
type: Class
equivalent class: Class
  intersection of: Objet pour le travail du bois
  intersection of: Restriction
    on property: comprend
  intersection of: Restriction
    on property: comprend
subclass of: Objet pour le travail du bois
source: https://usito.usherbrooke.ca/d%C3%A9finitions/%C3%A9go%C3%Afne
source: https://vitrinelinguistique.oqlf.gouv.qc.ca/fiche-gdt/fiche/8450851/egoine
comment: scie à bois manuelle comportant une lame rigide et une poignée à l'une de ses extrémités
alternative label: égoïne
preferred label: scie égoïne

Encensoir
type: Class
equivalent class: Class
  intersection of: Objet pour l’ablution, l’aspersion ou l’encensement
  intersection of: Restriction
    on property: est constitué de
    all values from: Métal
  intersection of: Restriction
    on property: P103 was intended for
  intersection of: Restriction
    on property: a pour contenu
  intersection of: Restriction
    on property: comprend
  intersection of: Restriction
    on property: comprend
subclass of: Objet pour l’ablution, l’aspersion ou l’encensement
subclass of: Brûle-parfum
source: http://data.culture.fr/thesaurus/resource/ark:/67717/T69-1374
source: https://usito.usherbrooke.ca/d%C3%A9finitions/encensoir
comment: objet pour l'encensement et brûle-parfum en métal suspendu à trois longues chaînes, comportant généralement un couvercle ajouré attaché à une quatrième chaîne, servant à brûler l'encens pendant les cérémonies religieuses
preferred label: encensoir

Faucille
type: Class
equivalent class: Class
  intersection of: Objet pour l’agriculture
  intersection of: Class
    union of: Restriction
      on property: est constitué de
    union of: Restriction
      on property: est constitué de
  intersection of: Restriction
    on property: permet de traiter
    some values from: Herbe
  intersection of: Restriction
    on property: comprend
  intersection of: Restriction
    on property: comprend
  intersection of: Restriction
    on property: permet de traiter
  intersection of: Restriction
    on property: permet de traiter
subclass of: Objet pour l’agriculture
source: https://nomenclature.info/nom/3379
source: https://usito.usherbrooke.ca/d%C3%A9finitions/faucille
source: https://vitrinelinguistique.oqlf.gouv.qc.ca/fiche-gdt/fiche/8355742/faucille
source: https://www.cnrtl.fr/definition/faucille
comment: outil composé d'une lame de fer ou d'acier courbée en demi-lune, unie ou dentée, fixée à une poignée de bois, servant à couper l'herbe et à récolter les plantes céréalières et les fourrages
preferred label: faucille

Fer à repasser
type: Class
subclass of: Objet pour l’entretien ou la maintenance
subclass of: Restriction
  on property: est constitué de
  all values from: Métal
subclass of: Restriction
  on property: comprend
source: https://usito.usherbrooke.ca/d%C3%A9finitions/fer#Ec92aD8d1821e334
source: https://vitrinelinguistique.oqlf.gouv.qc.ca/fiche-gdt/fiche/8457027/fer-a-repasser
comment: instrument en métal, à base plane, composé d’une poignée, servant à repasser le linge une fois chauffé
preferred label: fer à repasser

Fourchette
type: Class
equivalent class: Class
  intersection of: Objet pour le service des aliments
  intersection of: Restriction
    on property: comprend
  intersection of: Restriction
    on property: comprend
    min qualified cardinality: 2
    on class: Class
subclass of: Objet pour le service des aliments
source: https://usito.usherbrooke.ca/d%C3%A9finitions/fourchette
source: https://vitrinelinguistique.oqlf.gouv.qc.ca/fiche-gdt/fiche/3284038/fourchette
source: https://www.cnrtl.fr/definition/fourchette
comment: ustensile comportant un manche et plusieurs dents, servant à piquer les aliments
preferred label: fourchette

Haltère
type: Class
subclass of: Appareil récréatif
subclass of: Restriction
  on property: est constitué de
  all values from: Métal
subclass of: Restriction
  on property: comprend
subclass of: Restriction
  on property: comprend
  min qualified cardinality: 2
  on class: Poids
source: https://usito.usherbrooke.ca/d%C3%A9finitions/halt%C3%A8re
source: https://vitrinelinguistique.oqlf.gouv.qc.ca/fiche-gdt/fiche/10426166/haltere
source: https://www.cnrtl.fr/definition/halt%C3%A8re
comment: instrument de gymnastique composé de deux poids fixes ou de deux disques amovibles de métal, de poids et de taille variables, réunis par une tige, servant à être soulevé pour l'entraînement musculaire
preferred label: haltère

Horloge
type: Class
subclass of: Objet pour la chronométrie
source: https://usito.usherbrooke.ca/d%C3%A9finitions/horloge
source: https://www.cnrtl.fr/definition/horloge
comment: appareil de dimensions variables servant à mesurer le temps ou à indiquer les heures
preferred label: horloge

Manteau de raquetteur
type: Class
subclass of: Symbole personnel
subclass of: Manteau
comment: manteau porté par un raquetteur membre d'un club de raquetteurs
preferred label: manteau de raquetteur

Marionnette
type: Class
subclass of: Jouet
subclass of: Objet pour le divertissement du public
subclass of: Class
  union of: Restriction
    on property: P62 depicts
    some values from: E21 Person
  union of: Restriction
    on property: P62 depicts
    some values from: Animal
subclass of: Class
  union of: Restriction
    on property: est constitué de
    some values from: Bois
  union of: Restriction
    on property: est constitué de
    some values from: Tissu
  union of: Restriction
    on property: est constitué de
subclass of: Restriction
  on property: comprend
source: https://usito.usherbrooke.ca/d%C3%A9finitions/marionnette
source: https://vitrinelinguistique.oqlf.gouv.qc.ca/fiche-gdt/fiche/8487528/marionnette
source: https://www.cnrtl.fr/definition/marionnette
comment: figure de bois, de carton, de tissu ou d'un autre matériau, représentant un être humain ou un animal, articulée ou non, actionnée à la main ou à l'aide de fils par une personne généralement cachée et à laquelle on fait jouer un rôle
preferred label: marionnette

Métier
type: Class
subclass of: Objet pour le travail des textiles
subclass of: Restriction
  on property: permet de produire
  some values from: Tissu
subclass of: Restriction
  on property: permet de produire
  some values from: Œuvre tissée
source: https://usito.usherbrooke.ca/d%C3%A9finitions/m%C3%A9tier
source: https://www.cnrtl.fr/definition/m%C3%A9tier
comment: machine servant à confectionner un tissu ou une œuvre tissée
preferred label: métier
synonyme: métier à tisser

Microscope
type: Class
subclass of: Objet pour l’optique
subclass of: Restriction
  on property: comprend
  min qualified cardinality: 1
  on class: Lentille
source: https://usito.usherbrooke.ca/d%C3%A9finitions/microscope
source: https://vitrinelinguistique.oqlf.gouv.qc.ca/fiche-gdt/fiche/17027699/microscope
source: https://www.cnrtl.fr/definition/microscope
comment: instrument composé d'un tube renfermant plusieurs lentilles donnant l'image virtuelle d'un objet éclairé par transparence, servant à observer des éléments, objets, organismes invisibles à l'œil nu à diverses échelles
preferred label: microscope

Mortier
type: Class
equivalent class: Class
  intersection of: Objet à usage polyvalent pour le traitement des matériaux
  intersection of: Class
    intersection of: Restriction
      on property: est manipulé par
      all values from: Pilon
    intersection of: Restriction
      on property: comprend
  intersection of: Class
    union of: Restriction
      on property: est constitué de
      some values from: Métal
    union of: Restriction
      on property: est constitué de
      some values from: Bois
    union of: Restriction
      on property: est constitué de
      some values from: Porcelaine
    union of: Restriction
      on property: est constitué de
      some values from: Pierre
subclass of: Objet à usage polyvalent pour le traitement des matériaux
source: https://nomenclature.info/nom/4328
source: https://usito.usherbrooke.ca/d%C3%A9finitions/mortier
comment: récipient circulaire en pierre, en bois, en porcelaine ou en métal, évasé à parois épaisses et à fond arrondi, parfois muni d'un bec verseur, servant à contenir les substances à broyer à l'aide d'un pilon
preferred label: mortier

Pendule balistique
type: Class
subclass of: objet pour la mécanique
source: https://babelnet.org/synset
source: https://fr.wikipedia.org/wiki/Pendule_balistique
comment: dispositif de mesure de la vitesse d'un projectile à partir de l'effet de son impact sur un pendule pesant en supposant le choc parfaitement inélastique donc que le projectile demeurera dans le pendule
preferred label: pendule balistique

Pilon
type: Class
equivalent class: Class
  intersection of: Objet à usage polyvalent pour le traitement des matériaux
  intersection of: Class
    union of: Restriction
      on property: est constitué de
      some values from: Métal
    union of: Restriction
      on property: est constitué de
      some values from: Bois
    union of: Restriction
      on property: est constitué de
      some values from: Porcelaine
    union of: Restriction
      on property: est constitué de
      some values from: Pierre
  intersection of: Restriction
    on property: permet de manipuler
    all values from: Mortier
  intersection of: Restriction
    on property: comprend
  intersection of: Restriction
    on property: comprend
subclass of: Objet à usage polyvalent pour le traitement des matériaux
source: https://nomenclature.info/nom/4329
comment: instrument en pierre, en bois, en porcelaine ou en métal constitué d'une tige tronconique, renflée à son extrémité, situé dans le prolongement d'un manche, servant à broyer les substances contenus dans un mortier
preferred label: pilon

Pinceau
type: Class
equivalent class: Class
  intersection of: Objet pour la peinture ou le recouvrement
  intersection of: Class
    union of: Restriction
      on property: est constitué de
      some values from: Poil
    union of: Restriction
      on property: est constitué de
      some values from: Fibre ou produit des fibres
  intersection of: Restriction
    on property: comprend
  intersection of: Restriction
    on property: comprend
  intersection of: Restriction
    on property: comprend
subclass of: Objet pour la peinture ou le recouvrement
source: https://usito.usherbrooke.ca/d%C3%A9finitions/pinceau
source: https://www.cnrtl.fr/definition/pinceau
comment: instrument composé d'un faisceau, souvent effilé, de poils ou de fibres souples serrés par une virole au bout d'un manche, servant à étendre en couche mince une substance liquide ou semi-liquide sur un support et, ainsi, peindre, vernir, coller, etc.
preferred label: pinceau

Pistolet
type: Class
subclass of: Arme à feu
source: https://usito.usherbrooke.ca/d%C3%A9finitions/pistolet
source: https://www.cnrtl.fr/definition/pistolet
comment: arme à feu portative, à canon court, qui se tient d'une seule main
preferred label: pistolet

Planétaire
type: Class
subclass of: Objet pour l’astronomie
subclass of: Restriction
  on property: P62 depicts
source: https://vitrinelinguistique.oqlf.gouv.qc.ca/fiche-gdt/fiche/8390651/planetaire
comment: maquette du système solaire composé de dispositifs mécaniques afin de faire en sorte que les planètes se déplacent à leur vitesse relative autour du Soleil
preferred label: planétaire

Porte-bébé
type: Class
subclass of: Véhicule à propulsion ou à traction humaine
subclass of: Restriction
  on property: a pour patient
source: https://usito.usherbrooke.ca/d%C3%A9finitions/porte-b%C3%A9b%C3%A9
source: https://vitrinelinguistique.oqlf.gouv.qc.ca/fiche-gdt/fiche/8409124/porte-bebe
comment: dispositif de portage que l'on met sur son dos, son ventre ou sa hanche, et dans lequel on installe un bébé
preferred label: porte-bébé

Pot à cosmétiques
type: Class
equivalent class: Class
  intersection of: Article de toilette
  intersection of: Class
    union of: Class
      intersection of: Class
        union of: Restriction
      intersection of: Restriction
        on property: comprend
    union of: Restriction
      on property: comprend
  intersection of: Class
    union of: Restriction
      on property: est constitué de
      some values from: Métal
    union of: Restriction
      on property: est constitué de
      some values from: Verre
    union of: Restriction
      on property: est constitué de
      some values from: Céramique
subclass of: Article de toilette
source: https://nomenclature.info/nom/3004
comment: pot en métal, en céramique ou en verre, muni d’un bouchon ou d’un couvercle, servant à contenir des produits de beauté ou des onguents
preferred label: pot à cosmétiques

Scie à châssis
type: Class
subclass of: Scie alternative
source: https://vitrinelinguistique.oqlf.gouv.qc.ca/fiche-gdt/fiche/8430682/scie-a-chassis
comment: scie alternative comportant un certain nombre de lames de scie tendues dans la partie centrale d'un bâti animé d'un mouvement oscillant vertical, horizontal ou suivant une trajectoire en huit
preferred label: scie à châssis

Tapis
type: Class
equivalent class: Class
  intersection of: Revêtement de sol
  intersection of: Class
    union of: Restriction
      on property: est constitué de
      some values from: Soie (fibre)
    union of: Restriction
      on property: est constitué de
      some values from: Laine (fibre)
    union of: Restriction
      on property: est constitué de
      some values from: Fibre synthétique
    union of: Restriction
      on property: est constitué de
    union of: Restriction
      on property: est constitué de
  intersection of: Class
    union of: Restriction
      on property: résulte de
    union of: Restriction
      on property: résulte de
    union of: Restriction
      on property: résulte de
subclass of: Revêtement de sol
source: https://nomenclature.info/nom/1042
source: https://vitrinelinguistique.oqlf.gouv.qc.ca/fiche-gdt/fiche/3283271/tapis
comment: pièce en tissu (coton, laine, jute, soie ou synthétique) généralement à chaîne et à trame, tressée, tissée ou nouée, de forme rectangulaire, ronde, ovale ou octogonale et bordée de différentes finitions, que l'on pose sur le sol, servant à sert à protéger ou à décorer le plancher
preferred label: tapis

Téléviseur
type: Class
subclass of: Objet pour la télécommunication
subclass of: Restriction
  on property: comprend
source: https://usito.usherbrooke.ca/d%C3%A9finitions/t%C3%A9l%C3%A9viseur
source: https://vitrinelinguistique.oqlf.gouv.qc.ca/fiche-gdt/fiche/8869795/televiseur
source: https://www.cnrtl.fr/definition/t%C3%A9l%C3%A9viseur
comment: appareil servant à recevoir et à reproduire sur un écran les images transmises par la télévision
preferred label: téléviseur
abréviation: T. V.
abréviation: T.V.
abréviation: TV
synonyme: télévision

Tenaille
type: Class
equivalent class: Class
  intersection of: Objet pour le travail du métal
  intersection of: Restriction
    on property: est constitué de
    all values from: Métal
  intersection of: Restriction
    on property: comprend
subclass of: Objet pour le travail du métal
subclass of: Restriction
  on property: est constitué de
  all values from: Métal
subclass of: Restriction
  on property: comprend
source: https://usito.usherbrooke.ca/d%C3%A9finitions/tenaille
source: https://vitrinelinguistique.oqlf.gouv.qc.ca/fiche-gdt/fiche/8360093/tenailles
comment: outil de métal composé de deux pièces croisées et articulées qui se terminent par des mors, utilisé pour tenir, arracher ou couper certains objets
alternative label: tenailles
preferred label: tenaille

Tramway
type: Class
subclass of: Véhicule ferroviaire
source: https://usito.usherbrooke.ca/d%C3%A9finitions/tramway
source: https://vitrinelinguistique.oqlf.gouv.qc.ca/fiche-gdt/fiche/8418143/tramway
source: https://www.cnrtl.fr/definition/tramway
comment: véhicule ferroviaire circulant sur un chemin de fer électrique à rails plats, principalement en surface, installé en site propre ou intégré au réseau routier, servant au transport en commun dans une ville et ses banlieues
preferred label: tramway

Violon
type: Class
subclass of: Instrument à cordes
subclass of: Restriction
  on property: est manipulé par
  all values from: Archet
subclass of: Restriction
  on property: comprend
subclass of: Restriction
  on property: comprend
subclass of: Restriction
  on property: comprend
source: https://usito.usherbrooke.ca/d%C3%A9finitions/violon
comment: instrument à cordes frottées avec un archet, dont on joue en le tenant entre l'épaule et le menton, et dont le manche, recouvert d'une touche, se termine par une volute
preferred label: violon

Zootrope
type: Class
subclass of: Objet pour la communication visuelle
subclass of: Jouet
source: https://vitrinelinguistique.oqlf.gouv.qc.ca/fiche-gdt/fiche/18592798/zootrope
source: https://www.cnrtl.fr/definition/zootrope
comment: jouet dans lequel les mouvements décomposés d'un être vivant sont observés à travers les fentes d'un cylindre tournant, de manière à créer l'illusion du mouvement
alternative label: zoétrope cylindrique
preferred label: zootrope

Métal
type: Class
subclass of: Matière inorganique
source: http://vocab.getty.edu/page/aat/300010900
source: https://usito.usherbrooke.ca/d%C3%A9finitions/m%C3%A9tal_1
source: https://vitrinelinguistique.oqlf.gouv.qc.ca/fiche-gdt/fiche/8363003/metal
comment: élément chimique brillant, ductile, malléable, généralement bon conducteur électrique et thermique, libérant des cations et donnant des oxydes généralement basiques en se combinant avec l'oxygène
preferred label: métal

Bois
type: Class
subclass of: Matière végétale
source: https://usito.usherbrooke.ca/d%C3%A9finitions/bois
source: https://www.cnrtl.fr/definition/bois
comment: matière végétale compacte et fibreuse qui constitue l’arbre ou une partie de celui-ci utilisée dans la fabrication de nombreux objets
preferred label: bois

Papier
type: Class
subclass of: Produit des fibres
subclass of: Restriction
  on property: est constitué de
  some values from: Fibre végétale
source: https://terminology.collectionstrust.org.uk/British-Museum-materials/mathesp.htm#1431
source: https://usito.usherbrooke.ca/d%C3%A9finitions/papier
source: https://vitrinelinguistique.oqlf.gouv.qc.ca/fiche-gdt/fiche/2093118/papier
comment: produit de fibres végétales naturelles ou transformées, réduites en une pâte homogène que l'on étend et sèche pour former une feuille mince
preferred label: papier

Album
type: Class
subclass of: Souvenir
subclass of: Cahier
source: https://usito.usherbrooke.ca/d%C3%A9finitions/album
source: https://vitrinelinguistique.oqlf.gouv.qc.ca/fiche-gdt/fiche/8349995/album
comment: cahier, relié ou à feuillets, servant à contenir des notes, des dessins ou des objets de collection divers
preferred label: album

Photographie
type: Class
subclass of: Objet documentaire
subclass of: Œuvre visuelle
subclass of: Restriction
  on property: résulte de
  all values from: Procédé ou technique photographique
source: https://usito.usherbrooke.ca/d%C3%A9finitions/photographie
source: https://vitrinelinguistique.oqlf.gouv.qc.ca/fiche-gdt/fiche/17075837/photographie
source: https://www.cnrtl.fr/definition/photographie
comment: objet documentaire ou œuvre visuelle consistant en une image durable obtenue par des procédés photographiques
editorial note: Le terme « photographie » est généralement utilisé pour désigner l'image positive.
example: hologramme;photographie numérique
preferred label: photographie

Appeau
type: Class
subclass of: Objet pour la pêche ou le piégeage
subclass of: Class
  union of: Restriction
    on property: a pour patient
    some values from: Mammifère
  union of: Restriction
    on property: a pour patient
    some values from: Oiseau
source: https://usito.usherbrooke.ca/d%C3%A9finitions/appeau
source: https://vitrinelinguistique.oqlf.gouv.qc.ca/fiche-gdt/fiche/8433964/appeau
comment: objet pour la pêche ou le piégeage à vent ou à friction avec lequel on imite le cri des oiseaux et des mammifères pour les attirer
preferred label: appeau

Assiette
type: Class
subclass of: Objet pour le service des aliments
subclass of: Class
  union of: Restriction
    on property: est constitué de
    some values from: Métal
  union of: Restriction
    on property: est constitué de
    some values from: Bois
  union of: Restriction
    on property: est constitué de
    some values from: Verre
  union of: Restriction
    on property: est constitué de
    some values from: Céramique
source: https://nomenclature.info/nom/4867
source: https://usito.usherbrooke.ca/d%C3%A9finitions/assiette
source: https://www.cnrtl.fr/definition/assiette
comment: pièce de vaisselle individuelle en céramique, en métal, en verre ou en bois, servant à mettre ou recevoir les aliments à table
preferred label: assiette

Porcelaine
type: Class
equivalent class: Class
  intersection of: Céramique
  intersection of: Restriction
    on property: est constitué de
  intersection of: Restriction
    on property: est constitué de
subclass of: Céramique
source: http://vocab.getty.edu/page/aat/300010662
source: https://terminology.collectionstrust.org.uk/British-Museum-materials/mathesp.htm#1539
source: https://usito.usherbrooke.ca/d%C3%A9finitions/porcelaine
comment: céramique fine, dure et translucide obtenue par la cuisson d'une pâte composée de kaolin pur et de feldspath
preferred label: porcelaine

Église
type: Class
subclass of: Construction
source: https://usito.usherbrooke.ca/d%C3%A9finitions/%C3%A9glise
comment: construction servant à réunir les fidèles de la religion catholique ou orthodoxe pour l'exercice du culte public
preferred label: église

Polymère synthétique
type: Class
subclass of: Matière organique
source: https://vitrinelinguistique.oqlf.gouv.qc.ca/fiche-gdt/fiche/8351808/polymere
comment: composé macromoléculaire élaboré par l'humain formé par la répétition covalente d'un nombre élevé de composés chimiques de faible masse, généralement des monomères, dont la nature et l'assemblage lui confèrent une grande diversité de propriétés physicochimiques
preferred label: polymère synthétique

Tissu
type: Class
equivalent class: Class
  intersection of: Étoffe
  intersection of: Restriction
    on property: est constitué de
    some values from: Class
  intersection of: Restriction
    on property: résulte de
subclass of: Étoffe
source: https://vitrinelinguistique.oqlf.gouv.qc.ca/fiche-gdt/fiche/8872085/tissu
comment: étoffe souple formée par l'entrecroisement d'au moins deux ensembles de fils et servant notamment à la fabrication d'habits et d'ameublement
preferred label: tissu
synonyme: étoffe tissée

Fourrure
type: Class
subclass of: Matière animale transformée
source: https://terminology.collectionstrust.org.uk/British-Museum-materials/mathesf.htm#790
source: https://www.cnrtl.fr/definition/fourrure
comment: peau qui, après avoir subi un traitement approprié, sert à confectionner ou à garnir des vêtements, des parures, des articles d'ameublement, etc.
preferred label: fourrure

Verre
type: Class
subclass of: Matière inorganique
subclass of: Restriction
  on property: est constitué de
source: http://vocab.getty.edu/page/aat/300010797
source: https://terminology.collectionstrust.org.uk/British-Museum-materials/mathesg.htm#823
source: https://usito.usherbrooke.ca/d%C3%A9finitions/verre
source: https://vitrinelinguistique.oqlf.gouv.qc.ca/fiche-gdt/fiche/17028601/verre
comment: matière inorganique solide, amorphe, formée de silicate alcalin, dure, fragile, généralement transparente, mais peut aussi être translucide ou opaque
preferred label: verre

Étoffe
type: Class
subclass of: Produit des fibres
subclass of: Restriction
  on property: résulte de
  some values from: Procédé ou technique de construction textile
source: https://vitrinelinguistique.oqlf.gouv.qc.ca/fiche-gdt/fiche/8367489/etoffe
comment: fibre tissée, tricotée, en feutre, aiguilletée ou réalisée selon tout autre mode de production
preferred label: étoffe

Soie (fibre)
type: Class
equivalent class: Class
  intersection of: Fibre animale
  intersection of: Class
    union of: Restriction
      on property: provient de
      all values from: Insecte
    union of: Restriction
      on property: provient de
subclass of: Fibre animale
source: https://vitrinelinguistique.oqlf.gouv.qc.ca/fiche-gdt/fiche/8397597/soie
comment: fibre animale filamenteuse souple, fine, solide, brillante, qui durcit à l'air en fournissant un fil résistant, produite par la larve de certains insectes, particulièrement le ver à soie lorsqu'il construit son cocon
preferred label: soie

Laine (fibre)
type: Class
equivalent class: Class
  intersection of: Fibre animale
  intersection of: Restriction
    on property: provient de
    all values from: Mammifère
subclass of: Fibre animale
source: https://usito.usherbrooke.ca/d%C3%A9finitions/laine
source: https://vitrinelinguistique.oqlf.gouv.qc.ca/fiche-gdt/fiche/8396519/laine
comment: fibre animale souple, douce et frisée, provenant de la toison des moutons et du poil de certains autres mammifères
preferred label: laine

Sculpture
type: Class
equivalent class: Class
  intersection of: Œuvre visuelle
  intersection of: Class
    union of: Class
      union of: Restriction
        on property: est constitué de
        some values from: Métal
      union of: Restriction
        on property: est constitué de
    union of: Restriction
      on property: est constitué de
      some values from: Bois
    union of: Restriction
      on property: est constitué de
      some values from: Pierre
  intersection of: Restriction
    on property: résulte de
    all values from: Procédé ou technique de sculpture
subclass of: Œuvre visuelle
source: https://nomenclature.info/nom/12956
source: https://www.musees.qc.ca/fr/professionnel/guidesel/doccoll/fr/classificationarts/classificationartsdefinition.htm#souscat1_9
comment: œuvre visuelle tridimensionnelle où des images et des formes sont produites en sculptant ou en gravant une matière dure, en façonnant ou en moulant une matière malléable (qui durcit habituellement par la suite) ou en assemblant diverses parties pour fabriquer un objet tridimensionnel, de taille moyenne ou grande, faits de pierre, de bois, de bronze ou d’un autre métal
preferred label: sculpture

Pagaie simple
type: Class
subclass of: Aviron
source: https://usito.usherbrooke.ca/d%C3%A9finitions/pagaie
source: https://vitrinelinguistique.oqlf.gouv.qc.ca/fiche-gdt/fiche/8421881/pagaie
comment: aviron court, terminé en large pelle à une extrémité, qui n’est pas fixé à l’embarcation
preferred label: pagaie simple

Massue
type: Class
subclass of: Arme contondante
subclass of: Restriction
  on property: comprend
source: https://usito.usherbrooke.ca/d%C3%A9finitions/massue
source: https://www.cnrtl.fr/definition/massue
comment: arme contondante constituée d'un bâton noueux, gros et court, dont la tête renflée sert à frapper avec une grande violence, à assommer
preferred label: massue

Pierre
type: Class
subclass of: Minéral
source: https://usito.usherbrooke.ca/d%C3%A9finitions/pierre
source: https://www.cnrtl.fr/definition/pierre
comment: matière minérale solide plus ou moins dure qu'on rencontre en masses compactes à la surface et à l'intérieur du sol
preferred label: pierre

Ceinture
type: Class
subclass of: Accessoire vestimentaire
subclass of: Class
  union of: Restriction
    on property: est constitué de
    some values from: Métal
  union of: Restriction
    on property: est constitué de
    some values from: Étoffe
  union of: Restriction
    on property: est constitué de
    some values from: Plastique
  union of: Restriction
    on property: est constitué de
subclass of: Class
  union of: Restriction
    on property: comprend
  union of: Restriction
    on property: comprend
source: https://nomenclature.info/nom/2002
comment: longue bande en cuir, en étoffe, en métal ou en plastique, parfois nouée, généralement munie d’une boucle ou d'une agrafe, portée à la taille ou, selon la mode, à différents niveaux autour du corps à partir du buste jusqu'aux hanches, servant à orner, à ajuster ou à tenir un vêtement, ou à maintenir à portée de main divers objets
preferred label: ceinture

Siège
type: Class
subclass of: Meuble
source: https://usito.usherbrooke.ca/d%C3%A9finitions/si%C3%A8ge
comment: meuble servant à s'assoir
preferred label: siège

Locomotive
type: Class
subclass of: Véhicule ferroviaire
source: https://vitrinelinguistique.oqlf.gouv.qc.ca/fiche-gdt/fiche/8879901/locomotive
comment: véhicule ferroviaire, soit à force motrice et à moteur, soit à moteur seul (locomotive électrique), servant à déplacer et à acheminer d'autres véhicules
preferred label: locomotive

Crayon
type: Class
subclass of: Objet pour la communication écrite
subclass of: Restriction
  on property: est constitué de
  some values from: Métal
subclass of: Restriction
  on property: est constitué de
  some values from: Bois
subclass of: Restriction
  on property: est constitué de
  some values from: Plastique
subclass of: Restriction
  on property: est constitué de
  all values from: Minéral
source: http://vocab.getty.edu/page/aat/300022439
source: https://usito.usherbrooke.ca/d%C3%A9finitions/crayon
source: https://www.cnrtl.fr/definition/crayon
comment: instrument comprenant une tige d'un morceau de minéral tendre, enfermée dans du bois, du plastique ou du métal, servant à écrire ou à dessiner
preferred label: crayon

Jeu vidéo
type: Class
equivalent class: Class
  intersection of: Objet pour le jeu
  intersection of: Restriction
    on property: est manipulé par
    all values from: Console de jeu
subclass of: Objet pour le jeu
source: https://usito.usherbrooke.ca/d%C3%A9finitions/vid%C3%A9o#BB7bA9d39897e205
source: https://vitrinelinguistique.oqlf.gouv.qc.ca/fiche-gdt/fiche/8355614/jeu-video
source: https://www.cnrtl.fr/definition/jeu
comment: jeu caractérisé par un contenu audiovisuel et interactif, programmé et diffusé sur un support de stockage qui en permet l'affichage sur un écran, où le joueur contrôle l'action qui s'y déroule, à l'aide d'un périphérique de jeu, dans un but de divertissement ou de compétition
preferred label: jeu vidéo

Motif
type: Class
subclass of: E55 Type
source: https://usito.usherbrooke.ca/d%C3%A9finitions/motif
comment: thème ornemental ou figuratif, habituellement répété
preferred label: motif

Scie
type: Class
equivalent class: Class
  intersection of: Objet à usage polyvalent pour le traitement des matériaux
  intersection of: Restriction
    on property: comprend
subclass of: Objet à usage polyvalent pour le traitement des matériaux
source: https://usito.usherbrooke.ca/d%C3%A9finitions/scie
comment: machine-outil ou outil muni d’une lame métallique dentée servant à entamer et à couper un matériau dur grâce à un mouvement de va-et-vient ou de rotation
preferred label: scie

Brûle-parfum
type: Class
subclass of: Accessoire ménager
source: https://usito.usherbrooke.ca/d%C3%A9finitions/br%C3%BBle-parfum
source: https://www.cnrtl.fr/definition/br%C3%BBle-parfum
comment: petit récipient servant à brûler des substances aromatiques
preferred label: brûle-parfum

Herbe
type: Class
subclass of: Matière végétale
source: http://vocab.getty.edu/page/aat/300011872
source: https://usito.usherbrooke.ca/d%C3%A9finitions/herbe
source: https://www.cnrtl.fr/definition/herbe
comment: matière végétale comprenant les tiges ou les feuilles d'une plante phanérogame non ligneuse, annuelle, bisannuelle ou vivace, à tige molle et généralement verte, et dont les parties aériennes meurent chaque année
preferred label: herbe

Créature légendaire
type: Class
subclass of: E55 Type
source: https://babelnet.org/synset
source: https://fr.wikipedia.org/wiki/Cr%C3%A9ature_l%C3%A9gendaire
comment: créature, dans le domaine des mythologies, des légendes et des folklores, qui a été l'objet de croyances mais dont rien n'a prouvé l'existence
preferred label: créature légendaire

Manteau
type: Class
subclass of: Vêtement de dessus
subclass of: Restriction
  on property: est constitué de
  some values from: Tissu
subclass of: Restriction
  on property: comprend
subclass of: Restriction
  on property: comprend
source: https://nomenclature.info/nom/2361
source: https://usito.usherbrooke.ca/d%C3%A9finitions/manteau
source: https://www.cnrtl.fr/definition/manteau
comment: vêtement de dessus généralement long, ample, à manches longues et fermé sur le devant, fait de tissu ou d'autres matériaux, servant à être porté sur tout le corps afin de le protéger du froid ou des intempéries
preferred label: manteau

Œuvre tissée
type: Class
equivalent class: Class
  intersection of: Œuvre visuelle
  intersection of: Restriction
    on property: résulte de
subclass of: Œuvre visuelle
source: https://nomenclature.info/nom/12944
comment: œuvre visuelle créée à l’aide d’un processus de tissage
hidden label: oeuvre tissée
preferred label: œuvre tissée

Lentille
type: Class
subclass of: Objet pour l’optique
subclass of: Restriction
  on property: est constitué de
  all values from: Verre
source: https://usito.usherbrooke.ca/d%C3%A9finitions/lentille
source: https://www.cnrtl.fr/definition/lentille
comment: pièce de verre ou d'une substance transparente, à deux surfaces dont au moins l'une est courbe, qui fait dévier les rayons lumineux
preferred label: lentille

Poil
type: Class
subclass of: Matière animale
source: https://usito.usherbrooke.ca/d%C3%A9finitions/poil
comment: filament apparaissant sur la peau de certains animaux, spécialement des mammifères
preferred label: poil

Fibre
type: Class
subclass of: Fibre ou produit des fibres
source: https://usito.usherbrooke.ca/d%C3%A9finitions/textile
source: https://vitrinelinguistique.oqlf.gouv.qc.ca/fiche-gdt/fiche/8898013/textile
source: http://vocab.getty.edu/page/aat/300014024
source: https://vitrinelinguistique.oqlf.gouv.qc.ca/fiche-gdt/fiche/8398232/fibre
source: https://www.cnrtl.fr/definition/textile
comment: élément de matière, naturel ou synthétique, long, mince, flexible
preferred label: fibre

Céramique
type: Class
subclass of: Matière inorganique
subclass of: Restriction
  on property: est constitué de
  some values from: Minéral
source: http://vocab.getty.edu/page/aat/300235507
source: https://terminology.collectionstrust.org.uk/British-Museum-materials/mathesc.htm#420
source: https://vitrinelinguistique.oqlf.gouv.qc.ca/fiche-gdt/fiche/2199784/ceramique
comment: matériau solide, cassant, résistant à la chaleur et à la corrosion, à base de matières minérales, dont l'argile, cuites à haute température
preferred label: céramique

Cosmétique
type: Class
subclass of: Article de toilette
source: https://vitrinelinguistique.oqlf.gouv.qc.ca/fiche-gdt/fiche/8361465/cosmetique
comment: substance ou préparation destinée à être appliquée sur la peau, les cheveux, les dents ou les muqueuses buccales en vue de les nettoyer, de les protéger, de les maintenir en bon état, d'en modifier l'aspect, de les parfumer ou d'en corriger l'odeur
preferred label: cosmétique

Scie alternative
type: Class
subclass of: Scie
subclass of: Restriction
  on property: comprend
source: https://vitrinelinguistique.oqlf.gouv.qc.ca/fiche-gdt/fiche/17031046/scie-alternative
comment: scie munie d'une lame de coupe dentée sur une rive, disposée dans le prolongement du manche, effectuant un mouvement rectiligne alternatif à l'horizontale ou à la verticale, servant principalement aux coupes de dégrossissage et aux travaux de démolition
preferred label: scie alternative

Laine (étoffe)
type: Class
equivalent class: Class
  intersection of: Étoffe
  intersection of: Restriction
    on property: est constitué de
    some values from: Laine (fibre)
subclass of: Étoffe
comment: étoffe fabriquée à partir de la fibre de la toison du mouton et d'autres mammifères
preferred label: laine

Soie (tissu)
type: Class
equivalent class: Class
  intersection of: Tissu
  intersection of: Restriction
    on property: est constitué de
    all values from: Soie (fibre)
subclass of: Tissu
comment: tissu obtenu à partir de la soie
preferred label: soie

Archet
type: Class
equivalent class: Class
  intersection of: Accessoire musical
  intersection of: Class
    union of: Restriction
      on property: est constitué de
      all values from: Bois
    union of: Restriction
      on property: est constitué de
  intersection of: Restriction
    on property: est accessoire de
    all values from: Instrument à cordes
  intersection of: Restriction
    on property: est constitué de
subclass of: Accessoire musical
source: https://usito.usherbrooke.ca/d%C3%A9finitions/archet
source: https://vitrinelinguistique.oqlf.gouv.qc.ca/fiche-gdt/fiche/2199891/archet
comment: baguette de bois, généralement de bois de Pernambouc, flexible, droite ou légèrement incurvée, munie d'un faisceau de crins de cheval fixé à ses deux extrémités, servant, lorsque frottée sur les cordes de certains instruments de musique, à les faire vibrer et à commander la durée et l'intensité du son
preferred label: archet

Tire-ligne
type: Class
equivalent class: Class
  intersection of: Objet pour le graphisme
  intersection of: Restriction
    on property: comprend
    qualified cardinality: 2
    on class: Class
subclass of: Objet pour le graphisme
source: https://usito.usherbrooke.ca/d%C3%A9finitions/tire-ligne
source: https://www.cnrtl.fr/definition/tire-ligne
comment: instrument emmanché à deux lamelles plates, à écartement réglable, terminées en pointe, servant à tracer des lignes d'épaisseur constante
preferred label: tire-ligne

Alliage
type: Class
equivalent class: Class
  intersection of: Métal
  intersection of: Class
    intersection of: Restriction
      on property: est constitué de
      all values from: Métal
    intersection of: Restriction
      on property: est constitué de
      min qualified cardinality: 1
      on class: E57 Material
subclass of: Métal
source: https://usito.usherbrooke.ca/d%C3%A9finitions/alliage
source: https://vitrinelinguistique.oqlf.gouv.qc.ca/fiche-gdt/fiche/8395342/alliage
comment: corps métallique issu du mélange d'un métal avec un ou plusieurs éléments, métalliques ou non, miscibles les uns aux autres lorsqu'ils sont fondus et qui ne se séparent pas en couches distinctes lorsqu'ils sont solides, afin d'obtenir des propriétés mécaniques précises
comment: http://vocab.getty.edu/page/aat/300010902
preferred label: alliage

Boisson
type: Class
subclass of: Aliment
source: https://usito.usherbrooke.ca/d%C3%A9finitions/boisson
source: https://vitrinelinguistique.oqlf.gouv.qc.ca/fiche-gdt/fiche/8872875/boisson
source: https://www.cnrtl.fr/definition/boisson
comment: tout liquide qui se boit
preferred label: boisson

Organisme vivant
type: Class
subclass of: E55 Type
source: https://vitrinelinguistique.oqlf.gouv.qc.ca/fiche-gdt/fiche/8364368/organisme
comment: système formant une unité distincte et autonome constituée d'une ou de plusieurs cellules, ayant la capacité de se développer et assurant son existence par un échange avec son environnement
preferred label: organisme vivant

Procédé ou technique
type: Class
subclass of: E55 Type
source: http://vocab.getty.edu/page/aat/300053001
comment: action permettant de réaliser une activité particulière ou d'obtenir un résultat prédéterminé, exécutée sur ou avec des matériaux ou des objets
preferred label: procédé ou technique

Fibre animale
type: Class
subclass of: Fibre
subclass of: Matière animale
source: http://vocab.getty.edu/page/aat/300386673
source: https://vitrinelinguistique.oqlf.gouv.qc.ca/fiche-gdt/fiche/8396691/fibre-animale
comment: fibre d'origine animale
preferred label: fibre animale

Fibre végétale
type: Class
subclass of: Fibre
subclass of: Matière végétale
source: http://vocab.getty.edu/page/aat/300014031
comment: fibre d'origine végétale, y compris l'écorce, les tiges, les feuilles ou les graines
preferred label: fibre végétale

Matière animale transformée
type: Class
subclass of: Matière animale
source: http://vocab.getty.edu/page/aat/300193287
comment: matière animale ayant été conservée ou ayant subi un traitement particulier
preferred label: matière animale transformée

Matière explosive
type: Class
subclass of: E57 Material
source: http://vocab.getty.edu/page/aat/300015121
source: https://usito.usherbrooke.ca/d%C3%A9finitions/explosif
comment: matériau, généralement un composé ou mélange de corps, susceptible d’exploser et produit dans le but de provoquer une explosion
preferred label: matière explosive

Matière inorganique
type: Class
subclass of: E57 Material
source: https://vitrinelinguistique.oqlf.gouv.qc.ca/fiche-gdt/fiche/8483887/matiere-inorganique
comment: substance qui n'a pas de structure moléculaire à base de carbone
preferred label: matière inorganique

Matière organique
type: Class
equivalent class: Class
  intersection of: E57 Material
  intersection of: Restriction
    on property: est constitué de
subclass of: E57 Material
source: http://vocab.getty.edu/page/aat/300011792
comment: matériau contenant du carbone, y compris ceux issus d'organismes vivants
preferred label: matière organique

Matière végétale
type: Class
equivalent class: Class
  intersection of: Matière organique
  intersection of: Restriction
    on property: provient de
    all values from: Végétal
subclass of: Matière organique
comment: matière organique d'origine végétale
preferred label: matière végétale

Minéral
type: Class
subclass of: Matière inorganique
source: https://usito.usherbrooke.ca/d%C3%A9finitions/min%C3%A9ral
source: https://vitrinelinguistique.oqlf.gouv.qc.ca/fiche-gdt/fiche/8879127/mineral
source: https://www.cnrtl.fr/definition/min%C3%A9ral
comment: matière inorganique naturelle homogène, généralement solide, caractérisée par une composition chimique déterminée et une structure ordonnée, composant l'écorce terrestre, et plus spécialement qui constitue les matériaux de la surface du globe
preferred label: minéral

Cahier
type: Class
equivalent class: Class
  intersection of: Objet pour la communication écrite
  intersection of: Restriction
    on property: résulte de
subclass of: Objet pour la communication écrite
source: https://usito.usherbrooke.ca/d%C3%A9finitions/cahier
source: https://vitrinelinguistique.oqlf.gouv.qc.ca/fiche-gdt/fiche/2069254/cahier
comment: assemblage de feuilles de papier, agrafées ou cousues, protégées par une couverture et destinées à recevoir des notes manuscrites, des dessins, etc.
preferred label: cahier

Corne
type: Class
subclass of: Matière animale
subclass of: Restriction
  on property: provient de
  all values from: Mammifère
source: http://vocab.getty.edu/page/aat/300011826
source: https://terminology.collectionstrust.org.uk/British-Museum-materials/mathesh.htm#933
comment: matière animale composant les structures protéiques dures et semi-translucides poussant sur la tête de certains mammifères
preferred label: corne

Métal précieux
type: Class
subclass of: Métal
source: http://vocab.getty.edu/page/aat/300011054
comment: métal considéré comme ayant une valeur intrinsèque élevée
preferred label: métal précieux

Plastique
type: Class
subclass of: Matière organique
source: http://vocab.getty.edu/page/aat/300014570
source: https://vitrinelinguistique.oqlf.gouv.qc.ca/fiche-gdt/fiche/8402245/plastique
comment: matière organique naturelle ou synthétique constituée de macromolécules obtenues par polymérisation ou polycondensation et possédant, en général, la propriété d'être coulée, extrudée, modelée ou moulée lorsqu'elle est malléable ou liquide, puis rendue rigide ou légèrement élastique
preferred label: plastique

Produit des fibres
type: Class
equivalent class: Class
  intersection of: Fibre ou produit des fibres
  intersection of: Restriction
    on property: est constitué de
    some values from: Fibre
subclass of: Fibre ou produit des fibres
comment: matériau produit à partir de fibres animales, synthétiques ou végétales
preferred label: produit des fibres

Résine
type: Class
subclass of: Matière végétale
source: https://usito.usherbrooke.ca/d%C3%A9finitions/r%C3%A9sine
source: https://vitrinelinguistique.oqlf.gouv.qc.ca/fiche-gdt/fiche/26531295/resine
source: https://www.cnrtl.fr/definition/r%C3%A9sine
comment: matière végétale sécrétée par plusieurs plantes ligneuses, notamment des Conifères, qui contient des dérivés de phénols et de terpènes, solide ou semi-fluide, à cassure vitreuse, inflammable, non soluble dans l'eau, de couleur jaune ou brune
preferred label: résine

Rite religieux
type: Class
subclass of: E55 Type
source: https://usito.usherbrooke.ca/d%C3%A9finitions/rite
comment: ensemble de prescriptions qui règlent la célébration du culte en usage dans une communauté religieuse
preferred label: rite religieux

Sacrement catholique
type: Class
subclass of: Rite religieux
source: https://usito.usherbrooke.ca/d%C3%A9finitions/sacrement
source: https://vitrinelinguistique.oqlf.gouv.qc.ca/fiche-gdt/fiche/8364338/sacrement
comment: acte rituel, signe sacré de la grâce, institué par Jésus-Christ et actualisé dans l'Église, source par lui-même de la grâce divine à faire naître ou à augmenter
preferred label: sacrement catholique

Aviron
type: Class
subclass of: Accessoire pour le transport maritime
subclass of: Restriction
  on property: est accessoire de
  all values from: Embarcation
subclass of: Restriction
  on property: est constitué de
  all values from: Bois
source: https://usito.usherbrooke.ca/d%C3%A9finitions/aviron
comment: instrument formé d'un manche de bois dont l'extrémité large et plate sert à propulser et à manœuvrer une embarcation
preferred label: aviron

Aliment
type: Class
subclass of: E57 Material
source: https://vitrinelinguistique.oqlf.gouv.qc.ca/fiche-gdt/fiche/17075446/aliment
comment: substance dont l'introduction dans l'organisme contribue, après digestion, au maintien, à la croissance et au renouvellement des tissus, ainsi qu'à la satisfaction des besoins énergétiques
preferred label: aliment

Fibre ou produit des fibres
type: Class
subclass of: E57 Material
comment: substance, naturelle ou synthétique, longue, mince, flexible, ou matériau produit à partir de ces éléments
preferred label: fibre ou produit des fibres

Toile
type: Class
subclass of: Tissu
source: https://usito.usherbrooke.ca/d%C3%A9finitions/toile
source: https://vitrinelinguistique.oqlf.gouv.qc.ca/fiche-gdt/fiche/17558681/toile
comment: tissu d’armure unie ou simple, quelle que soit la matière avec laquelle il est exécuté
preferred label: toile

Argile
type: Class
subclass of: Minéral
source: https://terminology.collectionstrust.org.uk/British-Museum-materials/mathesc.htm#475
source: https://usito.usherbrooke.ca/d%C3%A9finitions/argile
source: https://vitrinelinguistique.oqlf.gouv.qc.ca/fiche-gdt/fiche/8400740/argile
comment: matière minérale terreuse à structure bi-dimensionnelle (feuillets) constituée principalement de silicates d'aluminium hydratés en fines particules, d'un diamètre inférieur à 2 microns, ayant généralement l'aspect d'une terre molle, imperméable
preferred label: argile

Matière animale
type: Class
equivalent class: Class
  intersection of: Matière organique
  intersection of: Restriction
    on property: provient de
    all values from: Animal
subclass of: Matière organique
comment: matière organique d'origine animale
preferred label: matière animale

Crin
type: Class
subclass of: Poil
source: https://usito.usherbrooke.ca/d%C3%A9finitions/crin
source: https://www.cnrtl.fr/definition/crin
comment: poil long et épais poussant à l'encolure et à la queue de certains animaux
preferred label: crin

Figurine
type: Class
equivalent class: Class
  intersection of: Sculpture
  intersection of: Class
    union of: Restriction
      on property: P62 depicts
      some values from: E21 Person
    union of: Restriction
      on property: P62 depicts
      some values from: Animal
    union of: Restriction
      on property: P62 depicts
      some values from: Créature légendaire
subclass of: Sculpture
source: https://nomenclature.info/nom/12978
source: https://usito.usherbrooke.ca/d%C3%A9finitions/figurine
comment: sculpture représentant un humain, un animal ou une créature légendaire à une taille équivalant à moins de la moitié d’une taille grandeur nature
preferred label: figurine

Chaise
type: Class
subclass of: Siège
subclass of: Restriction
  on property: comprend
subclass of: Restriction
  on property: comprend
source: https://nomenclature.info/nom/1090
source: https://vitrinelinguistique.oqlf.gouv.qc.ca/fiche-gdt/fiche/2086919/chaise
comment: siège à une seule place, sur pieds, à dossier et sans accoudoir
preferred label: chaise

Bobèche
type: Class
subclass of: Objet pour l’éclairage
source: https://usito.usherbrooke.ca/d%C3%A9finitions/bob%C3%A8che
source: https://vitrinelinguistique.oqlf.gouv.qc.ca/fiche-gdt/fiche/17583351/bobeche
source: https://www.cnrtl.fr/definition/bob%C3%A8che
comment: pièce cylindrique creuse à rebords qu’on adapte au chandelier, au flambeau, à la girandole ou au lustre, servant à recueillir la cire fondue
preferred label: bobèche

Appeau à orignal
type: Class
equivalent class: Class
  intersection of: Appeau
  intersection of: Restriction
    on property: a pour patient
subclass of: Appeau
source: https://usito.usherbrooke.ca/d%C3%A9finitions/appeau
source: https://vitrinelinguistique.oqlf.gouv.qc.ca/fiche-gdt/fiche/8433964/appeau
comment: appeau avec lequel on imite le cri de l'orignal pour l'attirer
preferred label: appeau à orignal

Flèche
type: Class
equivalent class: Class
  intersection of: Arme blanche
  intersection of: Restriction
    on property: est manipulé par
    some values from: Arc
  intersection of: Restriction
    on property: est constitué de
    some values from: Bois
  intersection of: Restriction
    on property: comprend
  intersection of: Restriction
    on property: comprend
subclass of: Arme blanche
source: https://usito.usherbrooke.ca/d%C3%A9finitions/fl%C3%A8che
comment: arme blanche et arme de de jet composée d'un fût de bois muni d'une pointe aiguë à une extrémité, d'un empennage à l'autre, et que l'on lance principalement à l'aide d'un arc
preferred label: flèche

Virevent
type: Class
subclass of: Objet pour la météorologie
subclass of: Jouet
subclass of: Restriction
  on property: comprend
subclass of: Restriction
  on property: comprend
subclass of: Restriction
  on property: comprend
source: https://vitrinelinguistique.oqlf.gouv.qc.ca/fiche-gdt/fiche/8418289/moulin-a-vent
comment: jouet ou objet pour la météorologie fait de pales légères, fixées en leur centre par une tige liée à un bâtonnet, et qui tournent au vent
preferred label: virevent
synonyme: moulin à vent

Anche
type: Class
subclass of: Accessoire musical
subclass of: Class
  union of: Restriction
    on property: est constitué de
    some values from: Métal
  union of: Restriction
    on property: est constitué de
subclass of: Restriction
  on property: est accessoire de
  all values from: Instrument à vent
source: https://usito.usherbrooke.ca/d%C3%A9finitions/anche
source: https://www.cnrtl.fr/definition/anche
comment: fine languette de roseau ou de métal placée sur certains instruments à vent et dont la vibration permet de produire le son
preferred label: anche

Poids
type: Class
subclass of: Appareil récréatif
source: https://usito.usherbrooke.ca/d%C3%A9finitions/poids
comment: appareil récréatif composé d'un objet lourd, servant à être soulevé pour l’entraînement musculaire
preferred label: poids

Casse-tête (jeu)
type: Class
subclass of: Objet pour le jeu
subclass of: Restriction
  on property: est constitué de
subclass of: Restriction
  on property: résulte de
source: https://usito.usherbrooke.ca/d%C3%A9finitions/casse-t%C3%Aate
source: https://vitrinelinguistique.oqlf.gouv.qc.ca/fiche-gdt/fiche/8871815/casse-tete
comment: jeu de patience qui consiste à reconstituer une image en agençant, en emboîtant, correctement des pièces cartonnées, découpées de manière irrégulière
preferred label: casse-tête

Mammifère
type: Class
subclass of: Animal
source: https://vitrinelinguistique.oqlf.gouv.qc.ca/fiche-gdt/fiche/8980247/mammiferes
comment: animal appartenant à l'embranchement des vertébrés, dont les individus se caractérisent par la présence de glandes mammaires, d'osselets de l'ouïe, d'une mâchoire inférieure s'articulant directement avec le crâne et de poils sur la peau à un moment ou un autre de leur développement
preferred label: mammifère
synonyme: mammalia

Oiseau
type: Class
subclass of: Animal
source: https://usito.usherbrooke.ca/d%C3%A9finitions/oiseau
comment: animal vertébré, le plus souvent de petite taille, à peau recouverte de plumes, qui est pourvu d’un bec corné, de deux pattes écailleuses griffues et de deux ailes généralement bien adaptées au vol, dont la femelle pond des œufs et qui, selon les espèces, peut émettre des chants plus ou moins développés et présenter des coloris de plumage variables selon l’âge, le sexe ou la saison
preferred label: oiseau

Procédé ou technique d’ouvrage à l’aiguille
type: Class
subclass of: Procédé ou technique
source: http://vocab.getty.edu/page/aat/300053652
comment: procédé ou technique réalisé avec une aiguille et du fil
preferred label: procédé ou technique d’ouvrage à l’aiguille

Procédé ou technique photographique
type: Class
subclass of: Procédé ou technique de création d’images
source: http://vocab.getty.edu/page/aat/300054225
source: https://vitrinelinguistique.oqlf.gouv.qc.ca/fiche-gdt/fiche/17075837/photographie
comment: procédé ou technique de création d'images permettant ou facilitant la création de photographies, soit des images durables obtenues en exposant, généralement pendant une très courte durée, une surface photosensible à la lumière focalisée par un objectif
preferred label: technique ou procédé photographique

Végétal
type: Class
subclass of: Organisme vivant
source: https://vitrinelinguistique.oqlf.gouv.qc.ca/fiche-gdt/fiche/8363161/vegetal
comment: organisme vivant dont les cellules sont constituées d'une paroi cellulaire végétale, de vacuoles et de plastes
preferred label: végétal

Procédé ou technique de sculpture
type: Class
subclass of: Procédé ou technique
source: http://vocab.getty.edu/page/aat/300053618
comment: procédé ou technique permettant de concevoir des objets tridimensionnels avec des matériaux malléables ou durs
preferred label: procédé ou technique de sculpture

Procédé ou technique de soustraction
type: Class
subclass of: Procédé ou technique
source: http://vocab.getty.edu/page/aat/300229471
comment: procédé ou technique permettant de retirer, de retrancher un ou des éléments à d'autres
preferred label: procédé ou technique de soustraction

Fibre synthétique
type: Class
subclass of: Fibre
subclass of: Restriction
  on property: est constitué de
  all values from: E57 Material
source: http://vocab.getty.edu/page/aat/300014058
source: https://vitrinelinguistique.oqlf.gouv.qc.ca/fiche-gdt/fiche/17032424/fibres-synthetiques
comment: fibre élaborée industriellement, à partir de substances chimiques, se différenciant ainsi des matériaux apparaissant naturellement sous forme fibreuse
preferred label: fibre synthétique
synonyme: fibre manufacturée

kaolin
type: NamedIndividual
type: Concept

fasteners
type: NamedIndividual
type: Concept

assembling (additive and joining process)
type: NamedIndividual
type: Concept

fastening
type: NamedIndividual
type: Concept

stapling
type: NamedIndividual
type: Concept

cutting (shaping or dividing)
type: NamedIndividual
type: Concept

knotting
type: NamedIndividual
type: Concept

embroidering
type: NamedIndividual
type: Concept

sewing (needleworking technique)
type: NamedIndividual
type: Concept

aspersion
type: NamedIndividual
type: Rite religieux
source: https://usito.usherbrooke.ca/d%C3%A9finitions/aspersion
source: https://www.cnrtl.fr/definition/aspersion
definition: rite religieux consistant à asperger d'eau bénite

cheval
type: NamedIndividual
type: Mammifère
source: https://usito.usherbrooke.ca/d%C3%A9finitions/cheval
source: https://vitrinelinguistique.oqlf.gouv.qc.ca/fiche-gdt/fiche/8403776/cheval
source: https://www.cnrtl.fr/definition/cheval
definition: mammifère ongulé appartenant à la famille des équidés, souvent de grande taille et à crinière longue et souple, à queue composée de longs crins dès la racine, qui a été domestiqué notamment comme animal de selle et de trait
hidden label: equus caballus
hidden label: equus ferus caballus

silicate
type: NamedIndividual
type: Matière inorganique
source: https://vitrinelinguistique.oqlf.gouv.qc.ca/fiche-gdt/fiche/8981053/silicate
definition: minéral tétraédrique formé essentiellement de silicium et d'oxygène

cadran
type: NamedIndividual
type: Objet à usage polyvalent pour le traitement des matériaux
source: https://usito.usherbrooke.ca/d%C3%A9finitions/cadran
source: https://www.cnrtl.fr/definition/cadran
definition: surface portant des divisions ou des repères devant lesquels se déplacent une ou plusieurs aiguilles, servant à indiquer les variations d'une grandeur (pression, vitesse, etc.), soit un système de repérage

vache
type: NamedIndividual
type: Mammifère
source: https://www.cnrtl.fr/definition/vache
definition: bovidé domestique à cornes, femelle du taureau élevée principalement pour ses qualités de reproductrice et de laitière
synonyme: bos taurus

poudre à canon
type: NamedIndividual
type: Matière explosive
source: https://usito.usherbrooke.ca/d%C3%A9finitions/poudre
alternative label: poudre
definition: substance pulvérulente explosive utilisée pour le lancement d'un projectile par une arme à feu ou pour provoquer une explosion

fonte émaillée
type: NamedIndividual
type: Alliage
source: https://usito.usherbrooke.ca/d%C3%A9finitions/fonte_1
definition: alliage de fer, de carbone, obtenu par fusion du minerai de fer en haut-fourneau recouverte d'un émail

virole
type: NamedIndividual
type: Composant d’objet à usage polyvalent
source: https://usito.usherbrooke.ca/d%C3%A9finitions/virole
source: https://www.cnrtl.fr/definition/virole
definition: petit anneau de métal plat assujetti au bout d'une canne, d'un manche d'outil ou de couteau pour les empêcher de se fendre

col
type: NamedIndividual
type: Composant vestimentaire
source: https://usito.usherbrooke.ca/d%C3%A9finitions/col
source: https://vitrinelinguistique.oqlf.gouv.qc.ca/fiche-gdt/fiche/17491653/col
definition: partie du vêtement qui entoure le cou

lame (objet à usage polyvalent pour le traitement des matériaux)
type: NamedIndividual
type: Objet à usage polyvalent pour le traitement des matériaux
source: https://usito.usherbrooke.ca/d%C3%A9finitions/lame
source: https://www.cnrtl.fr/definition/lame
definition: bande mince, plate, de forme allongée, faite de métal ou d'une matière dure, et servant à différents usages
preferred label: lame

touche
type: NamedIndividual
type: Composant musical
source: https://www.cnrtl.fr/definition/touche
definition: partie du manche où appuient les doigts pour déterminer la longueur de la corde à faire vibrer

nouer
type: NamedIndividual
type: Procédé ou technique de construction textile
source: knotting
definition: action consistant à entrelacer ou attacher un matériau linéaire pour former des noeuds, parfois de manière à produire des motifs décoratifs
hidden label: noué

torsader
type: NamedIndividual
type: Procédé ou technique
source: https://usito.usherbrooke.ca/d%C3%A9finitions/torsader
source: https://www.cnrtl.fr/definition/torsader
definition: action consistant à rouler, mettre en torsade
hidden label: torsadé

fourrage
type: NamedIndividual
type: Matière végétale
source: https://usito.usherbrooke.ca/d%C3%A9finitions/fourrage_1
source: https://www.cnrtl.fr/definition/fourrage
definition: substance d'origine végétale servant à la nourriture du bétail

ablution
type: NamedIndividual
type: Rite religieux
source: https://usito.usherbrooke.ca/d%C3%A9finitions/ablution
definition: rite du prêtre consistant à se laver les doigts avant la messe

acier
type: NamedIndividual
type: Alliage
source: https://terminology.collectionstrust.org.uk/British-Museum-materials/mathess.htm#1854
source: https://usito.usherbrooke.ca/d%C3%A9finitions/acier
source: https://vitrinelinguistique.oqlf.gouv.qc.ca/fiche-gdt/fiche/8363169/acier
source: https://www.cnrtl.fr/definition/acier
definition: alliage composé de fer et de carbone, plus dur et plus résistant que le fer, susceptible d'acquérir des propriétés variées (dureté, résistance, malléabilité) selon le traitement qu'on lui fait subir

agrafe
type: NamedIndividual
type: Composant vestimentaire
source: https://usito.usherbrooke.ca/d%C3%A9finitions/agrafe
source: https://www.cnrtl.fr/definition/agrafe
definition: attache formée d'un crochet à passer dans un anneau, une bride, servant à réunir entre elles deux parties d'un vêtement, d'une chaussure, ou à fixer un bijou, un stylographe, etc.

bois de pernambouc
type: NamedIndividual
type: Bois
source: https://terminology.collectionstrust.org.uk/British-Museum-materials/mathesb.htm#281
source: https://usito.usherbrooke.ca/d%C3%A9finitions/pernambouc
definition: bois rouge-orangé et très dense issu du pernambouc
synonyme: bois-brésil

encens
type: NamedIndividual
type: Résine
source: https://usito.usherbrooke.ca/d%C3%A9finitions/encens
source: https://www.cnrtl.fr/definition/encens
definition: résine aromatique d'origine orientale, qui dégage une odeur caractéristique et pénétrante en brûlant, notamment utilisée dans les cérémonies religieuses

aiguille (composant d’objet à usage polyvalent)
type: NamedIndividual
type: Composant d’objet à usage polyvalent
source: https://www.cnrtl.fr/definition/aiguille
definition: tige métallique faisant partie d'un objet élaboré par l'humain, servant à enregistrer un phénomène physique, à donner une indication quantitative
preferred label: aiguille

fibre de verre
type: NamedIndividual
type: Verre
source: https://terminology.collectionstrust.org.uk/British-Museum-materials/mathesf.htm#748
source: https://usito.usherbrooke.ca/d%C3%A9finitions/fibre#D74D0cAd33933e97
source: https://vitrinelinguistique.oqlf.gouv.qc.ca/fiche-gdt/fiche/8486194/fibre-de-verre
definition: verre fondu étiré en fibres fines et flexibles, incombustible et de bonne conductibilité thermique, utilisé pour le guipage des fils et, sous diverses formes, en qualité d'isolant

compartiment
type: NamedIndividual
type: Composant d’objet à usage polyvalent
source: https://usito.usherbrooke.ca/d%C3%A9finitions/compartiment
definition: division cloisonnée d’un espace permettant de loger des objets

assembler
type: NamedIndividual
type: Procédé ou technique d’addition ou d’assemblage
source: https://usito.usherbrooke.ca/d%C3%A9finitions/assembler
source: https://www.cnrtl.fr/definition/assembler
alternative label: assemblage
definition: action consistant à réunir plusieurs choses de manière à les ajuster, à leur donner leur place exacte dans un tout
hidden label: assemblé

bouchon
type: NamedIndividual
type: Composant d’objet à usage polyvalent
source: https://usito.usherbrooke.ca/d%C3%A9finitions/bouchon
definition: petite pièce, généralement cylindrique, s’encastrant dans le goulot d’une bouteille, d’un flacon, etc., pour les fermer

volute
type: NamedIndividual
type: Composant musical
source: https://www.cnrtl.fr/definition/volute
definition: élément décoratif en forme de spirale par lequel on termine le chevillier des instruments à archet modernes ou de leurs prédécesseurs immédiats

jute (plante)
type: NamedIndividual
type: Végétal
source: https://usito.usherbrooke.ca/d%C3%A9finitions/jute
definition: plante originaire d’Asie, à port buissonnant, à tige rigide et fibreuse, qu’on cultive pour ses fibres textiles, utilisées à diverses fins
preferred label: jute

fléché
type: NamedIndividual
type: Procédé ou technique de construction textile
source: https://vitrinelinguistique.oqlf.gouv.qc.ca/fiche-gdt/fiche/26504725/fleche
definition: technique artisanale qui consiste à entrecroiser des fils de laine avec les doigts pour créer des motifs de flèches et dans laquelle les fils de chaîne deviennent à tour de rôle le fil de trame

roseau (herbe)
type: NamedIndividual
type: Herbe
definition: herbe provenant du roseau
hidden label: herbe, roseau
preferred label: roseau

bœuf
type: NamedIndividual
type: Mammifère
source: https://usito.usherbrooke.ca/d%C3%A9finitions/boeuf
definition: grand bovidé à corps massif, à tête large et à cornes arquées, dont on élève diverses espèces pour la production de viande, de cuir et de lait
hidden label: boeuf
synonyme: bos taurus

surface photosensible
type: NamedIndividual
type: Objet pour la photographie
source: https://vitrinelinguistique.oqlf.gouv.qc.ca/fiche-gdt/fiche/3296041/surface-photosensible
definition: surface qui réagit à l'exposition d'un rayonnement électromagnétique et qui permet d'enregistrer et de reconstituer une image
synonyme: surface sensible

or
type: NamedIndividual
type: Métal précieux
source: https://terminology.collectionstrust.org.uk/British-Museum-materials/mathesg.htm#836
source: https://usito.usherbrooke.ca/d%C3%A9finitions/or_1
source: https://vitrinelinguistique.oqlf.gouv.qc.ca/fiche-gdt/fiche/8872591/or
source: https://www.cnrtl.fr/definition/or
definition: métal précieux, jaune brillant, très dense, très malléable et très ductile, inaltérable à l’air, à l’eau et aux acides, utilisé notamment en bijouterie, en orfèvrerie et en dentisterie

rebord
type: NamedIndividual
type: Composant d’objet à usage polyvalent
source: https://usito.usherbrooke.ca/d%C3%A9finitions/rebord
source: https://www.cnrtl.fr/definition/rebord
definition: partie relevée en saillie qui forme le bord

vinyle
type: NamedIndividual
type: Plastique
source: http://vocab.getty.edu/page/aat/300014502
definition: plastique dérivé du chlorure de vinyle, de l'acétate de vinyle ou du chlorure de vinylidène
scope note: Le terme est couramment utilisé pour désigner tous les polymères et copolymères dont le chlorure de vinyle est un constituant.

faisceau
type: NamedIndividual
type: Composant d’objet à usage polyvalent
source: https://usito.usherbrooke.ca/d%C3%A9finitions/faisceau
definition: assemblage de choses de même nature et de forme allongée, liées ensemble ou qui convergent à une de leur extrémité

soufflet
type: NamedIndividual
type: Objet à usage polyvalent pour le traitement des matériaux
type: Composant musical
source: https://usito.usherbrooke.ca/d%C3%A9finitions/soufflet
source: https://www.cnrtl.fr/definition/soufflet
definition: instrument utilisé pour souffler de l'air sur un point donné, composé d'une cavité souple, généralement en cuir, fixée entre deux tablettes qui se déplient en faisant entrer l'air et se replient en le chassant

eucharistie
type: NamedIndividual
type: Sacrement catholique
source: https://www.cnrtl.fr/definition/eucharistie
definition: sacrement contenant le corps, le sang et la divinité du Christ au terme de la transsubstantiation du pain et du vin, renouvelant rituellement en action de grâce le sacrifice du Christ et constituant la nourriture des fidèles et le symbole de leur unité

carbone
type: NamedIndividual
type: Matière inorganique
source: https://usito.usherbrooke.ca/d%C3%A9finitions/carbone
source: https://www.cnrtl.fr/definition/carbone
definition: corps simple métalloïde, de numéro atomique 6, très répandu dans la nature soit à l'état pur (diamant, graphite), soit, le plus souvent, combiné avec d'autres corps (gaz carbonique de l'air, charbons, pétrole, etc.)

argent
type: NamedIndividual
type: Métal précieux
source: http://vocab.getty.edu/page/aat/300011029
source: https://terminology.collectionstrust.org.uk/British-Museum-materials/mathess.htm#1782
source: https://vitrinelinguistique.oqlf.gouv.qc.ca/fiche-gdt/fiche/17026464/argent
definition: métal précieux, blanc, brillant, très ductile et malléable, inoxydable

serrure
type: NamedIndividual
type: Objet pour la protection ou la répression
source: https://usito.usherbrooke.ca/d%C3%A9finitions/serrure
source: https://vitrinelinguistique.oqlf.gouv.qc.ca/fiche-gdt/fiche/17027900/serrure
definition: appareil de fermeture comportant un mécanisme se manœuvrant à la main à l'aide d'un accessoire généralement amovible, comme clef, bouton, etc., ou à distance

étain
type: NamedIndividual
type: Métal
source: https://terminology.collectionstrust.org.uk/British-Museum-materials/mathest.htm#1923
source: https://usito.usherbrooke.ca/d%C3%A9finitions/%C3%A9tain
definition: métal gris blanc, ductile, malléable, le plus fusible de tous les métaux usuels, qui s'effrite aux très basses températures

coton (fibre)
type: NamedIndividual
type: Fibre végétale
source: http://vocab.getty.edu/page/aat/300183670
source: https://terminology.collectionstrust.org.uk/British-Museum-materials/mathesc.htm#544
source: https://usito.usherbrooke.ca/d%C3%A9finitions/coton
source: https://www.cnrtl.fr/definition/coton
definition: fibre végétale soyeuse blanche à jaunâtre, entourant les graines du cotonnier
hidden label: fibre, coton
preferred label: coton

relier
type: NamedIndividual
type: Procédé ou technique d’addition ou d’assemblage
source: https://usito.usherbrooke.ca/d%C3%A9finitions/relier
source: https://vitrinelinguistique.oqlf.gouv.qc.ca/fiche-gdt/fiche/8367509/relier
source: https://www.cnrtl.fr/definition/relier
comment: action consistant à assembler et à attacher des feuillets, spécialement ceux qui composent un ouvrage, et les couvrir d'une matière rigide
hidden label: relié

érable
type: NamedIndividual
type: Végétal
source: https://usito.usherbrooke.ca/d%C3%A9finitions/%C3%A9rable
definition: arbre des régions tempérées et froides de l’hémisphère Nord, souvent de grande taille, à feuilles dentées, généralement larges et profondément découpées, dont les fruits sont des samares doubles et dont plusieurs espèces sont cultivées pour leur valeur ornementale

pied
type: NamedIndividual
type: Composant d’objet à usage polyvalent
source: https://usito.usherbrooke.ca/d%C3%A9finitions/pied
definition: partie d'un objet jouant un rôle de soutien

calotte
type: NamedIndividual
type: Composant vestimentaire
source: https://vitrinelinguistique.oqlf.gouv.qc.ca/fiche-gdt/fiche/2073726/calotte
definition: partie principale du chapeau qui couvre plus ou moins la tête

réconciliation ou pénitence
type: NamedIndividual
type: Sacrement catholique
source: https://usito.usherbrooke.ca/d%C3%A9finitions/p%C3%A9nitence
source: https://usito.usherbrooke.ca/d%C3%A9finitions/r%C3%A9conciliation#aa9E5Dfd23453e59
definition: sacrement catholique par lequel le prêtre donne l’absolution au confessé et par lequel un pécheur se réconcilie avec Dieu, avec l'Église

cotonnier
type: NamedIndividual
type: Végétal
source: https://usito.usherbrooke.ca/d%C3%A9finitions/cotonnier
definition: plante originaire des régions tropicales et subtropicales, voisine de l’hibiscus, dont on cultive certaines espèces pour leurs fruits à graines oléagineuses qui fournissent la fibre de coton, destinée à la fabrication textile, et une huile végétale, utilisée à des fins alimentaires, cosmétiques ou industrielles

anse
type: NamedIndividual
type: Composant d’objet à usage polyvalent
source: https://usito.usherbrooke.ca/d%C3%A9finitions/anse
source: https://www.cnrtl.fr/definition/anse
definition: partie saillante en forme d’arc ou d’anneau, servant à saisir et porter un objet

tige (composant d’objet à usage polyvalent)
type: NamedIndividual
type: Composant d’objet à usage polyvalent
source: https://usito.usherbrooke.ca/d%C3%A9finitions/tige
definition: partie d'un objet allongée, cylindrique et généralement rigide
preferred label: tige

cuir
type: NamedIndividual
type: Matière animale transformée
source: https://terminology.collectionstrust.org.uk/British-Museum-materials/mathesl.htm#1086
source: https://usito.usherbrooke.ca/d%C3%A9finitions/cuir
source: https://www.cnrtl.fr/definition/cuir
definition: matière imputrescible, relativement résistante à l'eau, souple, obtenue par tannage de la peau d'un animal et utilisée à diverses fins
hidden label: peau, cuir

lame de scie
type: NamedIndividual
type: Objet à usage polyvalent pour le traitement des matériaux
source: https://vitrinelinguistique.oqlf.gouv.qc.ca/fiche-gdt/fiche/8435377/lame
comment: lame en plaque d'acier plus ou moins rigide comportant sur sa (ou ses) rive une denture, servant à, grâce au mouvement qui lui est donné par la scie dont elle fait partie, à couper

bâtonnet
type: NamedIndividual
type: Objet à usage polyvalent pour le traitement des matériaux
source: https://usito.usherbrooke.ca/d%C3%A9finitions/b%C3%A2tonnet
definition: petit bâton

lacet
type: NamedIndividual
type: Accessoire vestimentaire
source: https://usito.usherbrooke.ca/d%C3%A9finitions/lacet
source: https://www.cnrtl.fr/definition/lacet
definition: cordon étroit, rond ou plat, que l’on passe dans des œillets ou des crochets, servant à serrer et attacher une chaussure ou ajuster un vêtement

bec
type: NamedIndividual
type: Composant d’objet à usage polyvalent
source: https://usito.usherbrooke.ca/d%C3%A9finitions/bec
definition: partie d’objet permettant le passage ou l’écoulement d’un liquide

couvercle
type: NamedIndividual
type: Objet à usage polyvalent pour le traitement des matériaux
source: https://usito.usherbrooke.ca/d%C3%A9finitions/couvercle
source: https://www.cnrtl.fr/definition/couvercle
definition: pièce mobile qui se place ou se rabat sur un contenant pour le fermer plus ou moins hermétiquement

eau bénite
type: NamedIndividual
type: Matière inorganique
source: https://babelnet.org/synset
source: https://fr.wikipedia.org/wiki/Eau_b%C3%A9nite
definition: eau naturelle consacrée au service divin par un rite de bénédiction

onguent
type: NamedIndividual
type: E57 Material
source: https://usito.usherbrooke.ca/d%C3%A9finitions/onguent
source: https://vitrinelinguistique.oqlf.gouv.qc.ca/fiche-gdt/fiche/17012733/onguent
source: https://www.cnrtl.fr/definition/onguent
definition: substance médicamenteuse de consistance pâteuse, semi-solide, constituée de résines et de corps gras, servant à être appliquée sur la peau ou la muqueuse affectée pour la protéger et en favoriser la guérison

crin de cheval
type: NamedIndividual
type: Crin
source: https://terminology.collectionstrust.org.uk/British-Museum-materials/mathesh.htm#943
definition: crin provenant du cheval
hidden label: crin, cheval

jute (tissu)
type: NamedIndividual
type: Tissu
preferred label: jute
preferred label: tissu obtenu à partir de la fibre de jute

fer
type: NamedIndividual
type: Métal
source: https://terminology.collectionstrust.org.uk/British-Museum-materials/mathesi.htm#988
source: https://usito.usherbrooke.ca/d%C3%A9finitions/fer
source: https://www.cnrtl.fr/definition/fer
definition: métal résistant, d'un blanc grisâtre, magnétique, ductile et malléable, très peu utilisé à l'état pur

empennage
type: NamedIndividual
type: Composant d’armement
source: https://usito.usherbrooke.ca/d%C3%A9finitions/empennage
source: https://www.cnrtl.fr/definition/empennage
definition: garniture, généralement de plumes, fixée de part et d'autre du talon d'une flèche et destinée à assurer la stabilité de sa trajectoire

capuchon
type: NamedIndividual
type: Composant vestimentaire
source: https://usito.usherbrooke.ca/d%C3%A9finitions/capuchon
source: https://vitrinelinguistique.oqlf.gouv.qc.ca/fiche-gdt/fiche/2073719/capuchon
definition: large bonnet, souvent de forme plus ou moins conique, fixé à l'encolure d'un vêtement, pouvant être amovible, servant à protéger la tête contre le froid et la pluie

pointe
type: NamedIndividual
type: Composant d’objet à usage polyvalent
source: https://usito.usherbrooke.ca/d%C3%A9finitions/pointe
definition: extrémité amincie et aiguë d’une chose pouvant piquer, percer ou servant à piquer, percer, tracer, graver

céréale
type: NamedIndividual
type: Végétal
source: https://usito.usherbrooke.ca/d%C3%A9finitions/c%C3%A9r%C3%A9ale
definition: plante, généralement de type graminée, que l’on cultive pour ses grains comestibles

charnière
type: NamedIndividual
type: Objet à usage polyvalent pour le traitement des matériaux
source: https://usito.usherbrooke.ca/d%C3%A9finitions/charni%C3%A8re
definition: pièce métallique constituée de deux plaques imbriquées l'une dans l'autre et pivotant autour d'une tige

mors
type: NamedIndividual
type: Composant d’objet à usage polyvalent
source: https://usito.usherbrooke.ca/d%C3%A9finitions/mors
source: https://www.cnrtl.fr/definition/mors
definition: mâchoire d'un étau, de tenailles, de pinces, etc.

tête de flèche
type: NamedIndividual
type: Motif

attache
type: NamedIndividual
type: Objet à usage polyvalent pour le traitement des matériaux
source: https://usito.usherbrooke.ca/d%C3%A9finitions/attache
source: https://www.cnrtl.fr/definition/attache
definition: objet servant à attacher

agrafer
type: NamedIndividual
type: Procédé ou technique d’addition ou d’assemblage
source: https://usito.usherbrooke.ca/d%C3%A9finitions/agrafer
source: https://www.cnrtl.fr/definition/agrafer
alternative label: agrafage
definition: action consistant à attacher au moyen d'une ou de plusieurs agrafes
hidden label: agrafé

goulot
type: NamedIndividual
type: Composant d’objet à usage polyvalent
source: https://usito.usherbrooke.ca/d%C3%A9finitions/goulot
definition: col étroit d'une bouteille, d'un vase

corne de vache
type: NamedIndividual
type: Corne
source: https://terminology.collectionstrust.org.uk/British-Museum-materials/mathesc.htm#554
definition: corne provenant de la vache
hidden label: corne, vache

chaîne
type: NamedIndividual
type: Objet à usage polyvalent pour le traitement des matériaux
source: https://usito.usherbrooke.ca/d%C3%A9finitions/cha%C3%AEne
source: https://www.cnrtl.fr/definition/cha%C3%AEne
definition: suite d'anneaux de métal engagés les uns dans les autres et servant à de multiples usages

eau
type: NamedIndividual
type: Matière inorganique
source: https://terminology.collectionstrust.org.uk/British-Museum-materials/mathesw.htm#2040
source: https://usito.usherbrooke.ca/d%C3%A9finitions/eau
source: https://vitrinelinguistique.oqlf.gouv.qc.ca/fiche-gdt/fiche/8362508/eau
source: https://www.cnrtl.fr/definition/eau
definition: matière inorganique liquide constitué d'hydrogène et d'oxygène, inodore, incolore, transparent et sans saveur lorsqu'il est à l'état pur, que l'on trouve en abondance dans la nature et qui constitue un élément indispensable à toute forme de vie

découper
type: NamedIndividual
type: Procédé ou technique de soustraction
source: cutting (shaping or dividing)
source: https://usito.usherbrooke.ca/d%C3%A9finitions/d%C3%A9couper
source: https://www.cnrtl.fr/definition/d%C3%A9couper
alternative label: découpage
definition: action consistant à couper en morceaux, à diviser quelque chose en plusieurs parties
hidden label: découpé

confirmation
type: NamedIndividual
type: Sacrement catholique
source: https://usito.usherbrooke.ca/d%C3%A9finitions/confirmation
definition: sacrement catholique qui confirme un fidèle dans la grâce qu'il a reçue au baptême

encensement
type: NamedIndividual
type: Rite religieux
source: https://usito.usherbrooke.ca/d%C3%A9finitions/encenser
source: https://www.cnrtl.fr/definition/encenser
definition: rite religieux consistant à honorer en faisant brûler de l'encens

frange
type: NamedIndividual
type: Produit des fibres
source: https://usito.usherbrooke.ca/d%C3%A9finitions/frange
definition: rangée de fils, parfois travaillés en tresses, qui orne le bord d’une étoffe

prendre le dessert
type: NamedIndividual
type: E7 Activity
source: https://usito.usherbrooke.ca/d%C3%A9finitions/dessert
definition: activité consistant à prendre le mets généralement sucré ou le fruit que l'on sert à la fin d'un repas

lame (composant d’objet à usage polyvalent)
type: NamedIndividual
type: Composant d’objet à usage polyvalent
source: https://usito.usherbrooke.ca/d%C3%A9finitions/lame
source: https://www.cnrtl.fr/definition/lame
comment: partie tranchante d'une arme blanche ou d'un outil destiné à couper, percer, tailler, raser
preferred label: lame

cuivre
type: NamedIndividual
type: Métal
source: https://terminology.collectionstrust.org.uk/British-Museum-materials/mathesc.htm#521
source: https://usito.usherbrooke.ca/d%C3%A9finitions/cuivre
source: https://vitrinelinguistique.oqlf.gouv.qc.ca/fiche-gdt/fiche/8363168/cuivre
source: https://www.cnrtl.fr/definition/cuivre
definition: métal de couleur rouge-brun, ductile et malléable, bon conducteur d'électricité et thermique

bronze
type: NamedIndividual
type: Alliage
source: https://usito.usherbrooke.ca/d%C3%A9finitions/bronze
source: https://vitrinelinguistique.oqlf.gouv.qc.ca/fiche-gdt/fiche/8402577/bronze
source: https://www.cnrtl.fr/definition/bronze
definition: alliage de cuivre et d'étain, résistant, peu altérable, d'une belle couleur foncée et possédant des propriétés sonores

corne de bœuf
type: NamedIndividual
type: Corne
definition: corne provenant du bœuf
hidden label: corne de boeuf
hidden label: corne, boeuf
hidden label: corne, bœuf

kaolin
type: NamedIndividual
type: Argile
source: https://usito.usherbrooke.ca/d%C3%A9finitions/kaolin
source: https://www.cnrtl.fr/definition/kaolin
definition: argile réfractaire et friable, généralement de couleur blanche, utilisée en particulier dans la fabrication de la porcelaine

passe-bras
type: NamedIndividual
type: Composant vestimentaire
source: https://vitrinelinguistique.oqlf.gouv.qc.ca/fiche-gdt/fiche/2073443/passe-bras
definition: fente latérale pratiquée dans une cape, ou un autre vêtement du même genre, par où l'on passe le bras pour lui permettre une certaine liberté de mouvement

poudre d’amorçage
type: NamedIndividual
type: Matière explosive
source: https://www.btb.termiumplus.gc.ca/tpv2alpha/alpha-fra.html#resultrecs
definition: matière explosive très sensible dont la détonation provoquée entraîne à son tour celle de la masse principale d'explosif
preferred label: poudre d'amorçage

eau baptismale
type: NamedIndividual
type: Matière inorganique
source: https://fr.wikipedia.org/wiki/Eau_b%C3%A9nite
definition: eau bénite servant à l'administration du baptême

feldspath
type: NamedIndividual
type: Minéral
source: https://usito.usherbrooke.ca/d%C3%A9finitions/feldspath
source: https://www.cnrtl.fr/definition/feldspath
definition: minéral à base de silicate double d'aluminium et d'un métal alcalin ou alcalino-terreux, qui entre dans la composition d'un grand nombre de roches cristallines et que l'on utilise dans l'industrie de la céramique et du verre

battant
type: NamedIndividual
type: Composant musical
source: https://usito.usherbrooke.ca/d%C3%A9finitions/battant_1
definition: pièce métallique mobile suspendue à l'intérieur d'une cloche dont elle frappe et fait résonner les parois

corde (composant musical)
type: NamedIndividual
type: Composant musical
source: https://usito.usherbrooke.ca/d%C3%A9finitions/corde_1
source: https://www.cnrtl.fr/definition/corde
definition: fil de boyau, de soie, de nylon ou d'acier, tendu sur le corps de certains instruments et que l'on fait vibrer avec les doigts, un archet ou des marteaux
preferred label: corde

dent
type: NamedIndividual
type: E25 Human-Made Feature
source: https://www.cnrtl.fr/definition/dent
definition: élément saillant, généralement de forme aiguë

ver à soie
type: NamedIndividual
type: Insecte
source: https://usito.usherbrooke.ca/d%C3%A9finitions/ver#E3ED0Abd9081e272
definition: chenille du bombyx du mûrier, qu’on élève pour la production de la soie naturelle et que l’on nourrit de feuilles de mûrier

club de raquetteurs
type: NamedIndividual
type: E74 Group
source: https://vitrinelinguistique.oqlf.gouv.qc.ca/fiche-gdt/fiche/8359729/raquetteur
definition: regroupement de sportifs pratiquant la raquette à neige

bébé
type: NamedIndividual
type: E21 Person
source: https://usito.usherbrooke.ca/d%C3%A9finitions/b%C3%A9b%C3%A9
definition: enfant en bas âge

attacher
type: NamedIndividual
type: Procédé ou technique d’addition ou d’assemblage
source: https://usito.usherbrooke.ca/d%C3%A9finitions/attacher
source: https://www.cnrtl.fr/definition/attacher
definition: action consistant à fixer, maintenir immobile à l’aide d’un objet qui lie

boucle
type: NamedIndividual
type: Composant vestimentaire
source: https://usito.usherbrooke.ca/d%C3%A9finitions/boucle
definition: anneau ou rectangle généralement métallique, muni d'un ou de plusieurs ardillons et fixé à l'extrémité d'une ceinture ou d'une courroie pour en régler le serrage

tisser
type: NamedIndividual
type: Procédé ou technique d’addition ou d’assemblage
source: https://usito.usherbrooke.ca/d%C3%A9finitions/tisser
source: https://vitrinelinguistique.oqlf.gouv.qc.ca/fiche-gdt/fiche/17045404/tisser
source: https://www.cnrtl.fr/definition/tisser
alternative label: tissage
definition: entrecroiser des fils ou des fibres textiles longitudinaux avec des fils ou des fibres textiles transversaux de manière à en faire une nappe solide unie ou à relief qu'on appelle tissu, une tapisserie ou pour réaliser le dessin d'un tissu
hidden label: tissé

dossier
type: NamedIndividual
type: Composant de meuble
source: https://usito.usherbrooke.ca/d%C3%A9finitions/dossier
definition: partie d'un siège sur laquelle on appuie le dos

bière
type: NamedIndividual
type: Boisson
source: https://usito.usherbrooke.ca/d%C3%A9finitions/bi%C3%A8re_2
source: https://vitrinelinguistique.oqlf.gouv.qc.ca/fiche-gdt/fiche/8360740/biere
definition: boisson obtenue à partir de la fermentation alcoolique d’un moût de malt, de céréales, d’eau et de houblon

crochet
type: NamedIndividual
type: Objet à usage polyvalent pour le traitement des matériaux
source: https://usito.usherbrooke.ca/d%C3%A9finitions/crochet
source: https://www.cnrtl.fr/definition/crochet
definition: instrument dont l'extrémité est recourbée, souvent pointu, servant à fixer, accrocher ou tirer à soi quelque chose

flanelle de coton
type: NamedIndividual
type: Tissu
source: https://vitrinelinguistique.oqlf.gouv.qc.ca/fiche-gdt/fiche/8870834/flanelle-de-coton
alternative label: flanellette
alternative label: flannelette
definition: tissu de coton au toucher souple et moelleux, rendu pelucheux par un grattage ou un brossage sur ses deux faces ou sur l'une d'entre elles

eau d’érable
type: NamedIndividual
type: Matière végétale
source: https://usito.usherbrooke.ca/d%C3%A9finitions/%C3%A9rable#aFaeAed25798e364
definition: eau sucrée (sève brute) qui monte dans les érables au moment du dégel et que l’on récolte pour la production de sirop et de sucre
synonyme: sève d'érable

pale
type: NamedIndividual
type: Composant d’objet à usage polyvalent
source: https://usito.usherbrooke.ca/d%C3%A9finitions/pale_1
definition: petite planche, plaquette fixée ou articulée sur un axe

cadre
type: NamedIndividual
type: E25 Human-Made Feature
source: https://usito.usherbrooke.ca/d%C3%A9finitions/cadre
source: https://www.cnrtl.fr/definition/cadre
definition: assemblage de pièces rigides constituant l'armature de certains objets, servant de bordure ou de support

bâton
type: NamedIndividual
type: Composant d’objet à usage polyvalent
source: https://usito.usherbrooke.ca/d%C3%A9finitions/b%C3%A2ton
source: https://www.cnrtl.fr/definition/b%C3%A2ton
definition: morceau généralement de bois rond et allongé, servant d'appui, d'arme ou d'outil

déjeuner
type: NamedIndividual
type: E7 Activity
source: https://usito.usherbrooke.ca/d%C3%A9finitions/d%C3%A9jeuner_1
alternative label: déjeûner
alternative label: dîner
definition: activité consistant à prendre le repas du midi

carton
type: NamedIndividual
type: Papier
source: https://vitrinelinguistique.oqlf.gouv.qc.ca/fiche-gdt/fiche/8349293/papier-cartonne
source: https://www.cnrtl.fr/definition/carton
definition: papier à fort grammage, dont l'épaisseur lui confère un bon maintien et une bonne rigidité
synonyme: papier cartonné

tresser
type: NamedIndividual
type: Procédé ou technique
source: https://usito.usherbrooke.ca/d%C3%A9finitions/tresser
source: https://www.cnrtl.fr/definition/tresser
hidden label: action consistant à confectionner en entrelaçant des fils, des brins, des fibres
hidden label: tressé

mariage catholique
type: NamedIndividual
type: Sacrement catholique
source: http://www.ipir.ulaval.ca/fiche.php
alternative label: mariage
definition: sacrement catholique consistant en l'alliance matrimoniale, par laquelle un homme et une femme constituent entre eux une communauté de toute la vie, ordonnée par son caractère naturel au bien des conjoints ainsi qu'à la génération et à l'éducation des enfants

aiguille
type: NamedIndividual
type: Objet à usage polyvalent pour le traitement des matériaux
source: https://usito.usherbrooke.ca/d%C3%A9finitions/aiguille
definition: mince tige de métal dont une extrémité est pointue et l’autre percée d’un trou pour y passer un fil

onction des malades
type: NamedIndividual
type: Sacrement catholique
source: https://fr.wikipedia.org/wiki/Onction_des_malades
definition: sacrement catholique par lequel celui qui souffre est confié à la compassion du Christ
hidden label: extrême-onction

fil
type: NamedIndividual
type: Produit des fibres
source: https://usito.usherbrooke.ca/d%C3%A9finitions/fil
source: https://www.cnrtl.fr/definition/fil
definition: long brin de matière textile naturelle ou synthétique ou assemblage de ces brins, généralement par torsion

fermeture
type: NamedIndividual
type: Composant d’objet à usage polyvalent
source: https://usito.usherbrooke.ca/d%C3%A9finitions/fermeture
source: https://www.cnrtl.fr/definition/fermeture
definition: dispositif servant à rapprocher et fixer deux parties d'un objet

clavier
type: NamedIndividual
type: Composant musical
source: https://usito.usherbrooke.ca/d%C3%A9finitions/clavier
source: https://www.cnrtl.fr/definition/clavier
definition: ensemble des touches de certains instruments à vent ou à cordes, sur lesquelles on appuie pour produire des sons

coudre
type: NamedIndividual
type: Procédé ou technique d’addition ou d’assemblage
source: https://usito.usherbrooke.ca/d%C3%A9finitions/coudre_1
source: https://www.cnrtl.fr/definition/coudre
definition: action d'attacher au moyen de points faits avec un fil passé dans une aiguille

pernambouc
type: NamedIndividual
type: Végétal
source: https://usito.usherbrooke.ca/d%C3%A9finitions/pernambouc
definition: arbre du nord-est du Brésil, à tronc épineux, à feuilles composées et à fleurs papilionacées jaunes, dont le bois a longtemps été utilisé pour la production d’une teinture rouge
synonyme: paubrasilia echinata

pellicule
type: NamedIndividual
type: Objet pour la photographie
source: https://usito.usherbrooke.ca/d%C3%A9finitions/pellicule
source: https://www.cnrtl.fr/definition/pellicule
definition: feuille mince de matière plastique recouverte d'une émulsion sensible à la lumière, utilisée en photographie et au cinéma

ordre
type: NamedIndividual
type: Sacrement catholique
source: https://vitrinelinguistique.oqlf.gouv.qc.ca/fiche-gdt/fiche/8363997/ordre
definition: sacrement catholique qui confère, sous l'autorité d'un évêque, le pouvoir d'exercer certaines fonctions ecclésiastiques, en particulier celles de la prêtrise

broderie (procédé ou technique d’ouvrage à l’aiguille)
type: NamedIndividual
type: Procédé ou technique d’ouvrage à l’aiguille
source: https://nomenclature.info/nom/12916
source: https://usito.usherbrooke.ca/d%C3%A9finitions/broderie
source: https://www.cnrtl.fr/definition/broderie
definition: action, exécutée à la main ou à la machine, consistant à orner un tissu ou un autre support en cousant avec une aiguille et des fils (de coton, de soie, d'or, d'argent ou de laine) un motif ou un dessin
preferred label: broderie

écran
type: NamedIndividual
type: Objet pour la communication visuelle
source: https://usito.usherbrooke.ca/d%C3%A9finitions/%C3%A9cran
definition: surface permettant de voir des images transmises par ondes électromagnétiques

orignal
type: NamedIndividual
type: Mammifère
source: https://usito.usherbrooke.ca/d%C3%A9finitions/orignal
source: https://vitrinelinguistique.oqlf.gouv.qc.ca/fiche-gdt/fiche/8871650/orignal
definition: cervidé herbivore de grande taille des régions nordiques de l'Amérique et de l'Eurasie, à pelage brun noirâtre, caractérisé par un gros museau recourbé, un appendice pendant sous la gorge et de hautes épaules surmontées d'une bosse
preferred label: orginal
synonyme: élan d'Amérique

corde (objet à usage polyvalent pour le traitement des matériaux)
type: NamedIndividual
type: Objet à usage polyvalent pour le traitement des matériaux
source: https://usito.usherbrooke.ca/d%C3%A9finitions/corde_1
source: https://www.cnrtl.fr/definition/corde
definition: assemblage obtenu par torsion de fils de matières textiles (chanvre, coton, laine, soie), synthétiques (nylon), métalliques ou autres (poil, crin, écorce d'arbre, jonc, etc.), de grosseur et de longueur variables, et servant à lier, attacher, soutenir
preferred label: corde

baptême
type: NamedIndividual
type: Sacrement catholique
source: https://usito.usherbrooke.ca/d%C3%A9finitions/bapt%C3%AAme
source: https://vitrinelinguistique.oqlf.gouv.qc.ca/fiche-gdt/fiche/8367353/bapteme
source: https://www.cnrtl.fr/definition/bapt%C3%AAme
definition: sacrement catholique, administré au nom de la Trinité par le symbolisme de l'eau, destiné à introduire une personne dans la communauté chrétienne en la purifiant du péché originel

bretelle
type: NamedIndividual
type: Objet à usage polyvalent pour le traitement des matériaux
source: https://usito.usherbrooke.ca/d%C3%A9finitions/bretelle
source: https://www.cnrtl.fr/definition/bretelle
definition: bande de cuir, d'étoffe, qui, fixée à un objet lourd ou encombrant et passée sur l'épaule, permet de le porter plus facilement

manche (composant d’objet à usage polyvalent)
type: NamedIndividual
type: Composant d’objet à usage polyvalent
source: https://www.cnrtl.fr/definition/manche
definition: partie d'un outil, d'un instrument, généralement de forme allongée et plus ou moins droite, par laquelle on le tient lorsqu'on l'utilise
preferred label: manche

caoutchouc
type: NamedIndividual
type: E57 Material
source: https://usito.usherbrooke.ca/d%C3%A9finitions/caoutchouc

coton (tissu)
type: NamedIndividual
type: Tissu
source: https://terminology.collectionstrust.org.uk/British-Museum-materials/mathesc.htm#544
source: https://usito.usherbrooke.ca/d%C3%A9finitions/coton
definition: tissu obtenu à partir de la fibre de coton
preferred label: coton

jute (fibre)
type: NamedIndividual
type: Fibre végétale
source: http://vocab.getty.edu/page/aat/300014045
source: https://terminology.collectionstrust.org.uk/British-Museum-materials/mathesj.htm#1023
source: https://usito.usherbrooke.ca/d%C3%A9finitions/jute
source: https://vitrinelinguistique.oqlf.gouv.qc.ca/fiche-gdt/fiche/8397951/jute
definition: fibre végétale libérienne très résistante issue de la plante de jute
hidden label: fibre, jute
preferred label: jute

roseau (végétal)
type: NamedIndividual
type: Végétal
source: https://usito.usherbrooke.ca/d%C3%A9finitions/roseau
source: https://www.cnrtl.fr/definition/roseau
definition: Plante herbacée, souvent de grande taille et de type graminée, à feuilles étroites et élancées, à tige droite et robuste souvent remplie de moëlle, à fleurs disposées en panicule ou groupées en deux épis supersposés dont l'inférieur se développe sous la forme d'un cylindre brun foncé velouté, qui croît dans les marais et les eaux peu profondes
preferred label: roseau

tige (composant vestimentaire)
type: NamedIndividual
type: Composant vestimentaire
source: https://usito.usherbrooke.ca/d%C3%A9finitions/tige
source: https://www.cnrtl.fr/definition/tige
definition: partie d'une chaussure, d'une botte, qui couvre le dessus du pied, la cheville et éventuellement la jambe
preferred label: tige

manche (composant vestimentaire)
type: NamedIndividual
type: Composant vestimentaire
source: https://usito.usherbrooke.ca/d%C3%A9finitions/manche_1
definition: partie du vêtement qui recouvre le bras ou une partie du bras
preferred label: manche

poignée
type: NamedIndividual
type: Composant d’objet à usage polyvalent
source: https://usito.usherbrooke.ca/d%C3%A9finitions/poign%C3%A9e
definition: partie d’un objet conçu pour être saisi et tenu par la main fermée, servant à tenir ou porter l'objet

système solaire
type: NamedIndividual
type: E53 Place
source: https://usito.usherbrooke.ca/d%C3%A9finitions/solaire#CC30DEdd16736e86
definition: ensemble des astres (planètes, satellites, astéroïdes, comètes, etc.) qui gravitent autour du Soleil

min qualified cardinality: 2

min qualified cardinality: 1

Finition
source: https://usito.usherbrooke.ca/d%C3%A9finitions/finition
comment: Cette classe comprend les actions permettant de parfaire une exécution ou une fabrication.

FinitionMetal
comment: Cette classe comprend les actions permettant d'appliquer une finition sur une pièce de métal.

joint
comment: Cette propriété décrit la relation unissant une instance de la classe « Technique ou procédé pour assembler » et au moins deux objets joints par le biais de cette instance.

https://w3id.org/miron/materiau/1ae9b62f_568a_46f9_8a7c_0a025abc9802
source: https://vitrinelinguistique.oqlf.gouv.qc.ca/fiche-gdt/fiche/8362664/acier-inoxydable
alternative label: acier inox
alternative label: inox
definition: acier allié au chrome et au nickel, pratiquement inaltérable à l'air, résistant à divers agents de corrosion en milieu sec ou humide, à une température élevée ou cryogénique

https://w3id.org/miron/materiau/14561c34_6364_4e00_b16e_7d3e617d527f
source: https://vitrinelinguistique.oqlf.gouv.qc.ca/fiche-gdt/fiche/8363170/acier-galvanise
definition: acier qui a été recouvert d'une couche de zinc afin de former à sa surface un revêtement anticorrosion

https://w3id.org/miron/objet/6032d27e_ff0b_4c68_859d_38eaf6d0fa17
source: https://usito.usherbrooke.ca/d%C3%A9finitions/aiguille
source: https://www.cnrtl.fr/definition/aiguille
alternative label: aiguille à chas
definition: tige, généralement métallique, dont l'une des extrémités est effilée, l'autre percée d'un trou (le chas) permettant de passer un fil, utilisée dans les travaux de couture, de broderie, de tapisserie, etc.